program: Gaussian 09
title: 000097560
version: EM64L-G09RevD.01
frameworkgroup: C1[X(C15H10O5)]
method: RPBEPBE
basis: SDD
operation: Freq
keyword: #pfreq=noraman
keyword: PBEPBE/SDD
title: #p freq=noraman PBEPBE/SDD
converged: YES YES NO NO
title: Mulliken charges:
elementType: O O O O O C C C C C C C C C C C C C C C H H H H H H H H H H
charge: -0.374797 -0.173338 -0.304162 -0.367740 -0.386044 0.280318 0.172760 0.187104 0.109002 -0.225794 0.022161 -0.593332 0.203597 0.530351 0.143685 0.084135 -0.617169 -0.376770 -0.339585 -0.808144 0.299371 0.227582 0.225543 0.264828 0.239824 0.245319 0.224700 0.360352 0.358546 0.387698
chargesum: 0.00000
title: Mulliken charges with hydrogens summed into heavy atoms:
elementType: O O O O O C C C C C C C C C C C C C C C
charge: -0.014445 -0.173338 -0.304162 -0.009194 0.001654 0.280318 0.172760 0.187104 0.109002 -0.225794 0.022161 -0.293962 0.203597 0.530351 0.143685 0.084135 -0.389587 -0.151226 -0.074757 -0.098300
polarizability: 3.30302888e+02 2.35638800e+00 2.19769570e+02 -4.87980603e-01 -2.83353761e-01 7.28771477e+01
1716.lowfreq: -5.8704 -2.7007 -0.0006 0.0006 0.0007 6.9059 37.5967 47.3035 48.6867
frequency: 37.5898 47.2593 48.5984 90.0005 138.1905 154.9704 165.1224 198.1461 212.3314 260.7841 268.5949 302.8793 324.7952 353.6063 366.0108 400.5707 406.8052 428.2158 431.2626 433.4024 444.4386 448.0978 480.7978 489.6257 515.1769 537.8924 561.0061 584.7162 592.6626 651.8788 661.9921 698.5923 725.3022 764.7760 786.7915 814.7112 842.2796 845.6502 863.8459 924.2315 940.9534 946.7084 949.0545 988.6877 1001.5252 1018.9422 1048.7883 1077.1051 1111.8563 1163.3849 1165.1229 1186.5516 1225.9242 1251.5169 1257.6980 1270.8179 1282.5726 1316.6719 1341.6689 1398.0822 1399.9816 1406.9943 1412.4265 1423.8561 1459.0124 1468.6659 1474.4578 1485.8009 1532.1895 1546.7639 1584.6785 1586.7092 1612.0112 1629.7419 2527.4046 2980.3596 3063.2554 3092.8731 3103.6418 3115.8841 3154.2843 3179.5841 3530.1366 3532.0374
redmass: 6.8784 2.5421 1.3249 8.2135 6.0466 7.1064 4.9414 4.8204 4.7736 4.4884 6.7323 4.5545 5.4314 5.6407 9.4086 6.1055 1.1403 7.0712 1.8341 9.6202 2.1549 9.1244 7.1177 5.3737 4.6761 6.9685 3.9282 4.4446 3.7879 5.8374 4.0795 7.2357 5.4636 6.6948 8.7856 1.6315 1.9896 5.6225 3.1390 6.2849 1.3418 3.3038 1.8269 3.5642 1.0616 1.7830 1.5894 2.5881 2.7275 1.3516 1.5185 1.2740 1.9410 2.0216 3.3434 3.0413 3.3463 5.1861 5.0153 1.2659 6.3048 3.3262 8.3578 4.8084 2.2018 1.2684 1.1585 2.7725 6.5283 6.6681 6.2054 2.9089 6.8383 6.9537 1.0734 1.0388 1.0948 1.1001 1.0913 1.0902 1.0918 1.0951 1.0657 1.0656
irintensity: 10.1690 0.1439 0.3609 0.0854 0.0512 0.5056 3.0691 0.0218 0.7240 0.1630 0.7281 1.3415 10.2877 0.0403 11.5025 18.3809 119.0360 6.7986 65.6097 11.1196 66.7741 5.0463 4.7006 0.6387 10.0407 3.5998 2.3063 12.0055 17.6844 7.1861 1.5034 15.1217 3.3106 1.0070 17.5842 54.1910 28.3847 34.0184 5.2014 32.8945 3.3645 3.2070 5.8649 45.3933 125.9538 1.4134 24.0592 110.1270 137.7139 16.8867 29.4166 11.7484 125.7887 55.3423 14.8783 583.7342 1.0806 408.0054 32.2197 15.7634 33.3689 15.6377 6.6287 209.4468 134.9667 6.0581 14.9713 36.4225 129.3332 158.6756 58.1435 79.8200 23.3295 54.5629 179.7691 22.8074 18.5413 11.0904 24.3031 16.4114 4.0047 4.5729 47.6602 31.8988
temp: 298.150 k
press: 1.00000 atm
elementType: 8 8 8 8 8 6 6 6 6 6 6 6 6 6 6 6 6 6 6 6 1 1 1 1 1 1 1 1 1 1
symmnumber: 1
zpe: 559553.2 jmol-1
zpe.correction: 0.213123 hartree
zpe.thermalcorrener: 0.229612 hartree
zpe.thermalcorrenthalpy: 0.230556 hartree
zpe.thermalcorrgfe: 0.168968 hartree
zpe.sumelectzpe: -952.344260 hartree
zpe.sumelectthermal: -952.327770 hartree
zpe.sumelectthermalent: -952.326826 hartree
zpe.sumelectthermalfe: -952.388414 hartree
dipole: -2.1053 -1.0201 0.0742
dipole: 2.3406
quadrupole: -67.6269 -126.6789 -116.7883
quadrupole: -16.8692 -0.3230 -0.1813
quadrupole: 36.0712 -22.9809 -13.0903 -16.8692 -0.3230 -0.1813
hfenergy: -952.5573821 hartree
pointgroup: C01 [X(C15H10O5)]
dipole: 0.8301476 0.3975628 0.0276674 debye
polarizability: 330.3230827|1.848505|219.7506267|0.1318582|0.1418079|72.8758958 unknown
InChI: InChI=1S/C15H10O5/c1-6-4-7-11(10(18)5-6)15(20)13-9(17)3-2-8(16)12(13)14(7)19/h2-5,16-18H,1H3
charge 0 multiplicity 1
30 atoms
O  2.425343 -2.779505 -0.012548
O  -0.020074 2.818479 -0.010672
O  -0.236644 -2.705694 0.004636
O  -2.686852 2.899798 -0.004868
O  -2.705931 -2.708822 0.012705
C  1.157916 0.724563 -0.007163
C  1.135386 -0.707585 -0.005048
C  -1.403251 0.822894 -0.002489
C  -1.407558 -0.617313 0.001779
C  -0.107123 1.549085 -0.008223
C  -0.1587 -1.406692 -0.000304
C  2.375439 1.434756 -0.012668
C  2.396368 -1.387562 -0.009777
C  3.618393 0.7584 -0.012595
C  -2.651952 1.505964 -0.000806
C  -2.64952 -1.340333 0.007955
C  3.608423 -0.653886 -0.016045
C  -3.874518 0.76906 0.00505
C  -3.879543 -0.625462 0.009442
C  4.924721 1.526968 0.012327
H  2.324796 2.528119 -0.017027
H  4.562701 -1.199366 -0.023188
H  -4.828622 1.312881 0.006193
H  -4.811126 -1.197473 0.014121
H  4.836087 2.482677 -0.532042
H  5.215394 1.76976 1.052865
H  5.751023 0.948035 -0.435545
H  3.363984 -3.101948 -0.016282
H  -3.627308 3.216987 -0.00291
H  -1.703452 -3.032886 0.011028
