program: Gaussian 09
title: 000097551
version: EM64L-G09RevD.01
frameworkgroup: C1[X(C11H12N2O2)]
method: RPBEPBE
basis: SDD
operation: Freq
keyword: #p
keyword: freq=noraman
keyword: PBEPBE/SDD
title: #p freq=noraman PBEPBE/SDD
converged: NO YES NO NO
title: Mulliken charges:
elementType: O O N N C C C C C C C C C C C H H H H H H H H H H H H
charge: -0.212306 -0.215393 -0.033227 0.013291 0.039557 0.386911 0.198354 -0.712674 -0.712650 -0.052923 -0.583767 -0.812401 -0.291453 0.397721 -0.386098 0.229320 0.240114 0.219587 0.229329 0.219539 0.240121 0.295981 0.240872 0.240825 0.265235 0.266316 0.289817
chargesum: 0.00000
title: Mulliken charges with hydrogens summed into heavy atoms:
elementType: O O N N C C C C C C C C C C C
charge: -0.212306 -0.215393 -0.033227 0.013291 0.039557 0.386911 0.198354 -0.023653 -0.023660 -0.052923 -0.287786 -0.065468 -0.025137 0.397721 -0.096281
polarizability: 2.25520883e+02 3.61608926e+00 1.44915254e+02 -4.71049727e-03 -1.28807493e-02 7.70667359e+01
1716.lowfreq: -20.2866 -6.4957 -6.4508 -0.0004 0.0004 0.0006 52.5239 62.5872 101.4133
frequency: 52.4008 62.5627 101.4058 117.3505 148.5331 183.0173 189.5113 232.4189 249.9125 251.0798 264.8084 289.7418 326.6786 330.3923 371.6420 462.6333 483.8419 529.1682 549.8147 566.8217 575.8825 625.8683 666.7982 690.3292 702.1013 755.8891 779.3345 815.6280 862.1614 875.4186 936.7999 937.5484 944.4488 991.0063 997.4689 997.6053 1037.0629 1052.7931 1099.3093 1116.6303 1138.8351 1149.1811 1204.8513 1212.9866 1240.5755 1257.0191 1284.9542 1358.5925 1378.1583 1391.6056 1398.2219 1413.3856 1438.9389 1439.8323 1453.3413 1457.1671 1464.2849 1469.1314 1482.3006 1484.5615 1537.6894 1595.5426 1624.1290 2976.6999 2983.3075 2984.7857 3047.4619 3079.0817 3083.1119 3088.9787 3092.1926 3117.2063 3168.1976 3169.1323 3188.4568
redmass: 5.9899 5.4907 2.4409 1.3297 5.0172 3.8988 2.0500 1.1477 1.5847 2.1063 2.0874 4.5527 3.0570 6.2338 4.3346 3.0935 5.6330 5.3067 3.7942 4.8634 4.2073 3.5058 7.1487 5.3951 6.2089 5.5393 3.9883 3.5650 1.5271 5.3203 1.4867 2.1623 1.4149 1.3511 1.3148 1.8815 1.5717 1.8732 3.2738 1.3714 4.2950 2.1688 3.9179 8.7137 1.8537 3.1617 2.5775 10.0222 1.1727 1.3685 1.2043 3.6502 3.0576 1.5436 1.0486 2.7397 1.0472 1.0479 1.0650 1.1161 4.8910 8.1344 8.0070 1.0390 1.0345 1.0348 1.0955 1.1004 1.0996 1.1011 1.1007 1.0975 1.0915 1.0910 1.0965
irintensity: 0.4554 0.1891 0.2377 2.0204 2.3507 6.5304 0.3846 0.0075 0.6014 0.0318 0.3688 0.8724 2.2295 1.0374 0.3859 4.0854 1.4018 2.5809 2.8484 1.0028 3.5549 5.1971 4.8396 0.7996 14.2302 21.4457 0.7039 1.1623 40.7578 3.3848 17.4697 9.2284 4.8119 0.7630 0.7857 4.2588 0.9713 14.6364 6.8282 32.9402 0.3614 10.7718 7.0742 496.6255 0.2623 21.4003 13.1478 121.3772 12.5813 23.3439 4.3900 3.1380 55.1526 43.3154 26.1916 17.8538 2.4593 0.0028 17.2335 23.3649 119.0309 14.0420 29.9402 10.6358 19.6163 35.6388 12.4447 0.1646 43.3008 13.6875 29.1185 8.2880 1.1129 2.3404 1.9467
temp: 298.150 k
press: 1.00000 atm
elementType: 8 8 7 7 6 6 6 6 6 6 6 6 6 6 6 1 1 1 1 1 1 1 1 1 1 1 1
symmnumber: 1
zpe: 550747.1 jmol-1
zpe.correction: 0.209768 hartree
zpe.thermalcorrener: 0.223658 hartree
zpe.thermalcorrenthalpy: 0.224602 hartree
zpe.thermalcorrgfe: 0.169390 hartree
zpe.sumelectzpe: -685.153304 hartree
zpe.sumelectthermal: -685.139415 hartree
zpe.sumelectthermalent: -685.138471 hartree
zpe.sumelectthermalfe: -685.193683 hartree
dipole: -6.3613 -0.8085 -0.0014
dipole: 6.4125
quadrupole: -101.4077 -88.3155 -87.1523
quadrupole: 12.3631 -0.0119 0.0017
quadrupole: -9.1158 3.9763 5.1396 12.3631 -0.0119 0.0017
hfenergy: -685.3630722 hartree
pointgroup: C01 [X(C11H12N2O2)]
dipole: 2.4933388 -0.3848886 0.0005532 debye
polarizability: 225.2699439|-5.7654375|145.1661937|-0.0043644|0.0130021|77.0667359 unknown
InChI: InChI=1S/C11H12N2O2/c1-7-11(2,3)9-6-8(13(14)15)4-5-10(9)12-7/h4-6H,1-3H3
charge 0 multiplicity 1
27 atoms
O  -4.301375 0.424478 -0.000545
O  -3.45794 -1.69437 -0.0009
N  2.02451 1.528132 0.000025
N  -3.312581 -0.408262 0.000385
C  1.81361 -0.888076 -0.00021
C  0.435501 -0.232225 -0.000017
C  2.701449 0.384944 -0.000231
C  2.055215 -1.740785 -1.278539
C  2.055426 -1.740977 1.277949
C  0.629819 1.182106 0.000119
C  -0.850138 -0.776747 0.000074
C  4.198729 0.347541 -0.000508
C  -0.458159 2.077133 0.00033
C  -1.937903 0.135435 0.000289
C  -1.762609 1.540758 0.000396
H  1.352053 -2.592384 -1.3064
H  1.906911 -1.143433 -2.194984
H  3.082154 -2.148762 -1.286521
H  1.352117 -2.592452 1.305905
H  3.082288 -2.149153 1.285606
H  1.907487 -1.143712 2.194509
H  -1.052006 -1.851436 -0.000011
H  4.584497 -0.188358 -0.888994
H  4.584892 -0.191286 0.886007
H  4.603724 1.370749 0.000979
H  -0.286014 3.156732 0.000428
H  -2.647456 2.182411 0.000558
