program: Gaussian 09
title: 000097564
version: EM64L-G09RevD.01
frameworkgroup: C1[X(C11H20FN3O2)]
method: RPBEPBE
basis: SDD
operation: Freq
keyword: #p
keyword: freq=noraman
keyword: PBEPBE/SDD
title: #p freq=noraman PBEPBE/SDD
converged: YES YES NO NO
title: Mulliken charges:
elementType: F O O N N N C C C C C C C C C C C H H H H H H H H H H H H H H H H H H H H
charge: -0.235577 -0.283448 -0.235556 -0.415821 -0.178984 0.044404 0.394852 -0.457376 -0.474616 -0.045559 -0.453124 -0.481044 -0.745139 -0.752995 0.339709 -0.389535 -0.190176 0.209171 0.204812 0.211840 0.192329 0.259922 0.211812 0.235437 0.219120 0.216205 0.210364 0.213633 0.213278 0.216471 0.212213 0.215246 0.346683 0.269067 0.246836 0.248341 0.207205
chargesum: 0.00000
title: Mulliken charges with hydrogens summed into heavy atoms:
elementType: F O O N N N C C C C C C C C C C C
charge: -0.235577 -0.283448 -0.235556 -0.069138 -0.178984 0.044404 0.394852 -0.043392 -0.070447 0.214362 -0.005874 -0.045719 -0.107864 -0.109065 0.339709 0.126368 0.265370
polarizability: 1.73991603e+02 -9.43184118e-01 1.48920754e+02 9.00018651e-02 -6.77550516e+00 1.17812702e+02
1716.lowfreq: -11.1884 -4.7008 -0.0004 -0.0003 0.0010 9.1171 17.8221 30.6973 45.0794
frequency: 17.1673 30.3087 45.0102 66.8490 69.0022 93.7493 120.8986 160.9545 182.0684 192.6369 213.5235 241.5263 249.4439 255.6167 284.5566 320.3941 332.7174 350.1750 358.6020 388.4657 395.9941 401.8158 437.9917 464.2147 486.5913 498.3826 529.4947 657.3361 669.9465 690.2959 708.8236 731.8430 769.6487 777.9191 819.3339 853.0005 870.4215 894.3635 921.9052 930.6398 939.1510 945.7008 976.6116 980.9481 998.6938 1007.7503 1015.3474 1041.8204 1052.7192 1100.5940 1113.9488 1136.1143 1142.5515 1168.8792 1176.5468 1184.5463 1205.6243 1249.1600 1261.1287 1267.5287 1291.3693 1294.1973 1310.0397 1322.9796 1334.6084 1344.3829 1355.5697 1361.4503 1366.9711 1371.9436 1374.0737 1385.6966 1394.5363 1425.2971 1455.0096 1458.0258 1460.1479 1467.0121 1467.4571 1471.1209 1474.6274 1483.8568 1488.2635 1492.0571 1653.6928 2949.1033 2962.6392 2965.5502 2972.7485 2990.1454 2992.0293 3015.3591 3022.8160 3023.3004 3029.1341 3031.1119 3049.4235 3052.5082 3059.8384 3061.5341 3065.9720 3070.3329 3091.2456 3115.1521 3501.4694
redmass: 4.9322 4.7147 6.1527 4.0254 7.8621 6.4678 4.3945 3.0032 3.6197 1.3727 1.8861 1.2375 7.1642 4.0686 1.8696 3.0715 2.4275 2.8069 3.6830 2.5408 2.0527 2.0685 3.1357 5.0289 4.1658 2.7974 3.1397 2.1271 1.3091 2.8972 7.6617 5.8073 1.5719 3.9422 3.1501 2.3285 2.8233 2.1959 3.9116 1.6868 1.5810 1.9000 1.8896 1.6781 1.9920 1.4676 3.3010 2.0481 1.9648 1.1879 2.2265 2.0283 2.2358 1.3729 1.6895 2.3965 1.3572 2.5230 2.1271 1.5595 1.6026 1.4798 1.6844 1.3972 1.4441 1.3895 1.4937 1.4564 1.3530 1.3502 1.2043 3.6252 1.2181 1.1266 1.0722 1.0840 1.0925 1.1275 1.1090 1.0993 1.1107 1.0626 1.5384 1.0683 10.1567 1.0637 1.0439 1.0497 1.0389 1.0644 1.0643 1.0940 1.0935 1.0579 1.0890 1.0601 1.1010 1.1012 1.0995 1.0992 1.0986 1.0983 1.1041 1.1078 1.0770
irintensity: 0.4057 0.3788 0.8788 0.9002 3.2508 9.6297 1.0511 3.9316 1.1134 0.9954 0.1992 1.0444 7.3052 25.6364 0.0697 3.5270 6.3437 1.9370 2.5593 2.7164 1.0749 1.0807 2.4409 3.1276 2.5852 0.4043 11.2270 28.9713 53.8037 1.5800 16.9082 52.3803 0.7543 2.5175 49.7236 2.3630 10.1323 8.3444 211.0140 15.0245 1.9624 3.8379 7.8146 8.7500 3.6713 2.1684 34.4756 8.8136 2.0523 3.4327 13.0083 7.7655 23.7686 2.3388 3.9382 18.3205 5.4537 20.6388 9.0324 13.7039 4.5488 14.2494 13.9488 0.7407 7.4958 0.5181 3.1785 17.0040 17.4812 33.0626 19.8102 158.5547 13.2993 17.0461 5.5136 26.3710 21.1464 83.2158 35.3134 35.3080 27.2036 14.2366 336.1074 14.1576 260.2664 32.7462 14.5181 64.7594 20.9277 16.3946 17.7116 47.8166 35.5001 7.1063 30.2556 48.9292 16.0558 46.4604 20.2514 60.8973 70.7005 45.6490 1.9959 17.0908 33.7821
temp: 298.150 k
press: 1.00000 atm
elementType: 9 8 8 7 7 7 6 6 6 6 6 6 6 6 6 6 6 1 1 1 1 1 1 1 1 1 1 1 1 1 1 1 1 1 1 1 1
symmnumber: 1
zpe: 812113.6 jmol-1
zpe.correction: 0.309318 hartree
zpe.thermalcorrener: 0.327501 hartree
zpe.thermalcorrenthalpy: 0.328445 hartree
zpe.thermalcorrgfe: 0.261664 hartree
zpe.sumelectzpe: -844.322272 hartree
zpe.sumelectthermal: -844.304089 hartree
zpe.sumelectthermalent: -844.303145 hartree
zpe.sumelectthermalfe: -844.369926 hartree
dipole: 2.2963 -1.9615 -1.1286
dipole: 3.2240
quadrupole: -93.1268 -114.5215 -104.2755
quadrupole: 9.3735 2.1692 -0.4203
quadrupole: 10.8478 -10.5469 -0.3009 9.3735 2.1692 -0.4203
hfenergy: -844.63159 hartree
pointgroup: C01 [X(C11H20F1N3O2)]
dipole: 0.9077537 -0.8320302 -0.3042784 debye
polarizability: 174.0076861|-0.7860986|145.3251541|-0.3362509|-12.0063303|121.392219 unknown
InChI: InChI=1S/C11H20FN3O2/c1-11(2)5-3-9(4-6-11)13-10(16)15(14-17)8-7-12/h9,13H,3-8H2,1-2H3
charge 0 multiplicity 1
37 atoms
F  -3.850214 0.958114 1.886706
O  -1.556363 -2.047985 0.223357
O  -2.96765 2.034062 -1.392826
N  -0.04283 -0.480142 -0.650505
N  -2.363073 0.021717 -0.539753
N  -2.00539 1.236809 -1.144601
C  3.396551 0.645878 0.32913
C  2.27786 0.198478 1.320455
C  2.855664 0.521786 -1.129161
C  1.173019 -1.30617 -0.448249
C  1.695317 -1.199329 1.010044
C  2.263881 -0.872132 -1.455761
C  3.759573 2.126368 0.608619
C  4.67312 -0.218759 0.513695
C  -1.280437 -0.92302 -0.287109
C  -3.749469 -0.336329 -0.183076
C  -3.989938 -0.386089 1.327907
H  1.457304 0.945123 1.290006
H  2.675782 0.214553 2.354343
H  3.668213 0.752553 -1.846171
H  2.084344 1.306752 -1.284985
H  0.876327 -2.353697 -0.641584
H  2.467861 -1.979605 1.153814
H  0.871533 -1.439558 1.707194
H  1.850794 -0.882428 -2.482873
H  3.067559 -1.631825 -1.430476
H  4.542766 2.48323 -0.087329
H  2.876424 2.783122 0.491693
H  4.140548 2.252497 1.639859
H  4.490096 -1.293387 0.335351
H  5.467582 0.106223 -0.184617
H  5.065302 -0.114595 1.542935
H  0.024266 0.461259 -1.049105
H  -4.395461 0.426996 -0.650877
H  -3.976135 -1.331408 -0.605105
H  -3.259197 -1.034788 1.836845
H  -5.023029 -0.720874 1.532111
