program: Gaussian 09
title: 000097577
version: EM64L-G09RevD.01
frameworkgroup: C1[X(C10H14N2O5)]
method: RPBEPBE
basis: SDD
operation: Freq
keyword: #p
keyword: freq=noraman
keyword: PBEPBE/SDD
title: #p freq=noraman PBEPBE/SDD
converged: YES YES NO NO
title: Mulliken charges:
elementType: O O O O O N N C C C C C C C C C C H H H H H H H H H H H H H H
charge: -0.281485 -0.467934 -0.448391 -0.440110 -0.383711 -0.195951 -0.675662 -0.207973 -0.141485 -0.072048 -0.040440 -0.361505 0.293812 -0.133790 -0.509938 -0.392231 0.500683 0.234504 0.220377 0.281431 0.281584 0.199895 0.208858 0.391783 0.374448 0.314156 0.243179 0.225772 0.347330 0.319487 0.315354
chargesum: 0.00000
title: Mulliken charges with hydrogens summed into heavy atoms:
elementType: O O O O O N N C C C C C C C C C C
charge: -0.281485 -0.076151 -0.073943 -0.092779 -0.383711 -0.195951 -0.040821 0.026531 0.078892 0.209383 0.241144 0.047248 0.293812 0.180367 -0.266759 -0.166459 0.500683
polarizability: 1.86492203e+02 1.41411962e+01 1.49968569e+02 5.97940999e+00 -3.09633427e-01 8.29439346e+01
1716.lowfreq: -13.0342 -4.8864 0.0006 0.0010 0.0011 8.7881 20.9195 55.0744 68.1274
frequency: 20.6436 55.0578 68.0881 97.0395 116.6967 169.7258 181.7114 207.4831 212.0216 250.3901 265.7268 289.6060 306.4258 321.3815 354.1190 368.3133 394.8273 416.3955 442.1732 464.6995 483.3793 520.0634 532.1588 559.3464 570.4685 607.2929 658.7771 664.6961 711.6383 723.4707 750.1477 790.0933 805.9750 829.3732 838.3097 851.1049 886.7651 948.0998 964.2151 974.3856 976.8261 990.4962 1030.0040 1034.6416 1047.9571 1065.4717 1073.4248 1080.5407 1100.0465 1173.3439 1186.1426 1200.9078 1227.2633 1241.1373 1247.2796 1257.2427 1267.8343 1273.0254 1283.4674 1322.1612 1328.3541 1338.8360 1341.1142 1373.0957 1388.3096 1415.5914 1416.7025 1464.2261 1505.1346 1530.1440 1560.3199 1646.1912 1662.8247 2931.6816 2967.4234 2986.9302 2988.1541 3019.1618 3085.0369 3086.9102 3161.1057 3171.1830 3181.3889 3410.5530 3560.4491 3571.5106 3700.3579
redmass: 6.1496 6.2766 4.4389 6.0166 3.7417 5.5269 5.0631 6.1602 4.8439 1.1461 4.8094 4.8119 5.5925 5.7408 4.0116 6.3653 4.0202 1.0963 2.0369 1.4604 2.9811 5.7451 5.2013 1.2360 4.5549 5.9156 4.2090 4.5309 3.3468 4.7363 6.5192 1.4395 3.8011 1.1320 1.7278 4.4353 2.8697 2.7119 4.9694 1.3856 1.9133 3.2088 3.6929 3.8792 1.6630 4.0374 3.7095 2.3343 2.4402 1.5989 1.3362 1.2353 1.2237 2.0846 1.4470 1.3104 1.8704 1.5160 1.2816 1.2352 1.5006 1.2012 1.4124 1.7689 1.5544 1.5724 1.4787 1.0779 3.4568 6.8278 5.5521 1.2147 6.0092 1.0554 1.0854 1.0997 1.0907 1.0858 1.0663 1.0878 1.0885 1.0919 1.0992 1.0643 1.0453 1.0667 1.1041
irintensity: 0.5114 2.2587 7.0479 2.8126 5.2686 19.1759 8.1036 0.9852 7.1439 131.1151 28.8837 17.1655 2.2986 4.3006 5.6055 7.5339 9.8402 120.0882 72.2875 110.1000 58.3134 7.8568 4.4777 136.5494 25.9006 1.2581 9.8163 28.4361 2.0223 8.3440 5.1925 38.7339 32.2750 98.9104 67.4961 2.7156 25.5320 5.7779 67.7665 11.8385 18.5959 79.3453 58.2042 66.0671 19.1696 48.8745 73.0628 3.2443 73.0996 18.5195 12.0537 29.8443 2.5506 52.9451 250.1607 19.9876 3.7654 51.5562 29.3104 12.5155 2.5319 56.1343 32.0206 11.0031 111.3521 277.7730 8.0507 6.4825 67.7217 9.8204 127.4383 65.0962 631.0197 43.5019 9.7284 98.8627 58.3534 16.8473 637.8623 6.4780 8.1392 1.5741 15.9983 49.4541 94.5690 4.6661 26.7081
temp: 298.150 k
press: 1.00000 atm
elementType: 8 8 8 8 8 7 7 6 6 6 6 6 6 6 6 6 6 1 1 1 1 1 1 1 1 1 1 1 1 1 1
symmnumber: 1
zpe: 637275.8 jmol-1
zpe.correction: 0.242726 hartree
zpe.thermalcorrener: 0.258627 hartree
zpe.thermalcorrenthalpy: 0.259571 hartree
zpe.thermalcorrgfe: 0.199197 hartree
zpe.sumelectzpe: -873.775881 hartree
zpe.sumelectthermal: -873.759980 hartree
zpe.sumelectthermalent: -873.759036 hartree
zpe.sumelectthermalfe: -873.819410 hartree
dipole: 5.0568 5.4531 3.4213
dipole: 8.1862
quadrupole: -76.8796 -100.5215 -102.0269
quadrupole: 1.2767 -6.1779 8.9873
quadrupole: 16.2631 -7.3788 -8.8843 1.2767 -6.1779 8.9873
hfenergy: -874.018607 hartree
pointgroup: C01 [X(C10H14N2O5)]
dipole: 1.8560733 -2.2473369 -1.370153 debye
polarizability: 184.7773149|-15.8029644|151.3012235|-8.4712157|-0.3859733|83.3261675 unknown
InChI: InChI=1S/C10H14N2O5/c11-5-1-2-12(7(14)3-5)10-9(16)8(15)6(4-13)17-10/h1-3,6,8-10,13,15-16H,4,11H2
charge 0 multiplicity 1
31 atoms
O  -1.392346 -0.71481 1.038106
O  -1.367376 2.538116 -0.533947
O  -3.522573 1.469676 0.558694
O  -2.306277 -3.167981 -0.093803
O  1.22464 2.289381 -0.141774
N  0.767333 0.021796 0.280819
N  4.759272 -1.029643 -0.442153
C  -1.3829 1.092962 -0.58437
C  -2.83919 0.596991 -0.383807
C  -0.630627 0.447072 0.621819
C  -2.657003 -0.798532 0.242766
C  -2.573033 -1.913172 -0.806022
C  1.676015 1.078127 -0.060592
C  1.162696 -1.296604 0.371744
C  3.031406 0.685392 -0.292509
C  2.472159 -1.67051 0.128208
C  3.445222 -0.658622 -0.20848
H  -0.962688 0.707915 -1.536287
H  -3.391215 0.558581 -1.345411
H  -0.565255 1.174647 1.45344
H  -3.45656 -1.017952 0.968456
H  -1.769176 -1.697864 -1.543738
H  -3.54606 -1.953292 -1.34244
H  -0.385232 2.767109 -0.385646
H  -3.086766 2.364531 0.453078
H  0.374901 -1.999946 0.655028
H  3.73004 1.486629 -0.548581
H  2.754458 -2.723477 0.208818
H  -2.388623 -3.926426 -0.724617
H  5.464296 -0.333288 -0.668557
H  5.047659 -2.001707 -0.375542
