program: Gaussian 09
title: 000097525
version: EM64L-G09RevD.01
frameworkgroup: C1[X(C6H10N4)]
method: RPBEPBE
basis: SDD
operation: Freq
keyword: #pfreq=noraman
keyword: PBEPBE/SDD
title: #p freq=noraman PBEPBE/SDD
converged: YES YES NO NO
title: Mulliken charges:
elementType: N N N N C C C C C C H H H H H H H H H H
charge: -0.238431 -0.137373 -0.650045 -0.370109 0.444753 0.210377 -0.560905 -0.737953 -0.767335 0.190170 0.263093 0.257303 0.215015 0.255866 0.239630 0.229913 0.239557 0.319288 0.366348 0.230839
chargesum: 0.00000
title: Mulliken charges with hydrogens summed into heavy atoms:
elementType: N N N N C C C C C C
charge: -0.238431 -0.137373 0.035591 -0.139270 0.444753 0.210377 -0.297812 -0.009770 -0.058236 0.190170
polarizability: 1.27009960e+02 3.13873923e+00 1.02591216e+02 -1.80225439e-02 9.79460509e-03 4.93589352e+01
1716.lowfreq: -78.1067 -10.2452 -0.0004 -0.0003 -0.0002 5.0955 7.5870 69.8619 138.3875
frequency: -78.0803 69.8432 138.3838 156.1624 198.9354 208.0610 275.2302 337.4357 375.5865 390.5797 415.1467 531.9241 579.7681 604.8402 635.0404 652.2173 658.4602 689.8695 760.0069 768.0426 823.2709 977.0318 983.8841 1021.1045 1039.9749 1045.4419 1049.1829 1054.1940 1124.4014 1161.0326 1178.7994 1327.7881 1393.9204 1400.0044 1411.2293 1418.8134 1445.0835 1457.7556 1466.4631 1475.3548 1487.4191 1553.1095 1564.4705 1654.0431 2989.9784 2998.7791 3071.5136 3085.1424 3100.7462 3102.3228 3228.1957 3391.7140 3467.5346 3688.2454
redmass: 1.0272 5.0330 2.2888 1.4561 2.6049 3.4057 2.7402 3.0819 3.4748 1.1805 3.5861 3.4208 4.0280 2.5778 3.4507 1.5330 2.8710 7.4447 1.1940 4.5286 1.2846 2.0423 1.6599 2.2627 2.6663 1.5042 1.4931 1.4054 3.3981 1.4721 4.8095 4.3647 2.8532 1.3622 1.2502 2.4589 1.0441 1.5268 1.0447 3.5429 1.2879 1.7879 2.2805 6.4040 1.0372 1.0360 1.0982 1.0965 1.0988 1.1013 1.0993 1.0768 1.0514 1.0978
irintensity: 0.1915 4.0638 6.9712 6.7456 0.1859 6.9314 6.0036 18.2976 19.9039 121.1700 1.6271 0.5599 0.1004 33.1512 42.9080 156.5946 19.5014 1.7552 51.4556 3.7817 33.7151 14.0952 1.2360 5.7083 89.0323 10.3651 4.2468 78.1076 12.4484 12.6540 11.0168 54.5003 17.6528 22.6932 32.4019 98.3508 13.2770 25.6314 14.8217 77.4683 20.8010 211.1065 139.9206 319.8825 31.7038 18.0827 18.0652 8.2641 15.9686 25.4630 2.5804 15.2603 67.2601 66.0616
temp: 298.150 k
press: 1.00000 atm
elementType: 7 7 7 7 6 6 6 6 6 6 1 1 1 1 1 1 1 1 1 1
symmnumber: 1
zpe: 425173.6 jmol-1
zpe.correction: 0.161940 hartree
zpe.thermalcorrener: 0.171426 hartree
zpe.thermalcorrenthalpy: 0.172370 hartree
zpe.thermalcorrgfe: 0.127530 hartree
zpe.sumelectzpe: -452.879414 hartree
zpe.sumelectthermal: -452.869927 hartree
zpe.sumelectthermalent: -452.868983 hartree
zpe.sumelectthermalfe: -452.913823 hartree
dipole: -0.0515 -1.3620 -0.0109
dipole: 1.3630
quadrupole: -50.9675 -51.6767 -63.1139
quadrupole: -8.0037 -0.0403 0.0527
quadrupole: 4.2852 3.5760 -7.8612 -8.0037 -0.0403 0.0527
hfenergy: -453.0413536 hartree
pointgroup: C01 [X(C6H10N4)]
dipole: -0.0080324 0.5361656 -0.0029899 debye
dipolederiv: -1.2458966 0.2944498 -0.0097359 0.3679013 -0.3354009 0.0014629 -0.009655 0.0025769 -0.0212236 -0.0122934 0.051864 0.0020927 0.2426119 -0.5743309 0.0016375 0.0021387 -0.000404 -0.220046 -0.4890203 0.0956757 0.0053422 0.021989 -1.2316452 -0.0048751 0.0065574 -0.0081938 -0.6680719 -1.0067467 -0.3349928 -0.0067191 -0.5019859 -0.577172 -0.0046403 -0.0072492 -0.0033952 -0.4729839 0.6090128 0.0228244 0.0046043 -0.3286058 0.4026281 -0.0018205 0.0035402 -0.0007034 0.0090762 0.2933963 0.1235647 0.0031514 0.5183207 0.3739088 0.0054478 0.0058385 0.0024117 -0.0008788 -0.5631964 -0.166735 -0.002636 -0.3123144 -0.1809766 -0.0023297 -0.0031123 -0.0011852 -0.2682495 -0.0326131 -0.1935798 -0.0024067 -0.0892608 -0.0425299 -0.0006607 -0.001218 0.0007908 0.0496263 -0.0508523 -0.0528899 -0.0011426 -0.1622663 0.0117542 -0.0014947 -0.0035073 -0.0009353 0.0634646 1.7996817 -0.0508192 0.0128969 -0.0671068 1.4886958 0.0062517 0.0131817 0.004877 0.1601706 0.0452004 0.0786676 -0.0011203 0.0875542 0.0041111 0.0001644 -0.0010832 -0.000041 0.2006254 0.0518671 -0.0419032 -0.0815339 -0.0266055 0.0731279 0.0210415 -0.0933222 -0.011189 -0.014124 -0.0119051 0.1737664 0.0014021 0.0686781 -0.0972116 -0.0016027 0.0001046 -0.0013213 0.1150559 0.0499003 -0.0431185 0.0821256 -0.0280035 0.0704367 -0.0195707 0.0941749 0.012504 -0.0159874 0.030804 -0.0204065 0.0031402 -0.0649079 0.0231737 -0.1091428 -0.0646936 -0.1189486 -0.0407273 -0.0415453 0.0635128 -0.0001101 0.1555819 -0.0238224 -0.0005741 0.0007858 -0.0007864 0.116688 0.0311191 -0.0209475 -0.003389 -0.0666986 0.0190111 0.1095984 0.0644693 0.1198 -0.0354926 0.1059631 -0.0063651 -0.0041001 -0.0176796 0.2386762 -0.0003315 -0.0054561 0.0028334 0.3894111 0.3836456 -0.1209348 -0.0006843 -0.0881349 0.26751 -0.0001828 -0.0011778 0.0008951 0.3822629 0.0534787 0.1483668 -0.0011773 0.2909328 0.0900559 0.0016214 -0.0003163 0.0004144 0.2714039 unknown
polarizability: 126.6052119|4.4072493|102.9898906|0.6683503|0.1641047|49.3650089 unknown
InChI: InChI=1S/C6H10N4/c1-4-3-5(2)10(9-4)6(7)8/h3,7H,8H2,1-2H3
charge 0 multiplicity 1
20 atoms
N  -0.409633 0.102585 -0.067808
N  0.637542 1.045919 -0.057298
N  -1.775801 1.987395 -0.071289
N  -2.74509 -0.259738 -0.088558
C  0.065679 -1.213387 -0.066717
C  1.775495 0.299184 -0.048957
C  1.464478 -1.10003 -0.055014
C  -0.786889 -2.446183 -0.076219
C  3.127185 0.960729 -0.035583
C  -1.75694 0.603204 -0.077223
H  2.170175 -1.928066 -0.051524
H  -1.455537 -2.467727 -0.95334
H  -0.136635 -3.33748 -0.08403
H  -1.452777 -2.482941 0.802825
H  3.254501 1.592575 0.861906
H  3.928388 0.20363 -0.038723
H  3.263514 1.609918 -0.919183
H  -2.656107 2.491636 -0.086928
H  -0.869893 2.465833 -0.062647
H  -3.678555 0.189643 -0.09379
