program: Gaussian 09
title: 000097529
version: EM64L-G09RevD.01
frameworkgroup: C1[X(C12H10ClNO3)]
method: RPBEPBE
basis: SDD
operation: Freq
keyword: #p
keyword: freq=noraman
keyword: PBEPBE/SDD
title: #p freq=noraman PBEPBE/SDD
converged: YES YES NO NO
title: Mulliken charges:
elementType: Cl O O O N C C C C C C C C C C C C H H H H H H H H H H
charge: -0.005210 -0.211572 -0.198782 -0.447290 -0.386820 0.336604 0.587653 0.291692 -0.132343 -0.636247 0.013509 -0.343995 -0.374783 -0.373415 -0.365645 -0.231986 -0.221745 0.343809 0.230115 0.261088 0.288616 0.296665 0.210484 0.239611 0.240524 0.241351 0.348111
chargesum: 0.00000
title: Mulliken charges with hydrogens summed into heavy atoms:
elementType: Cl O O O N C C C C C C C C C C C C
charge: -0.005210 -0.211572 -0.198782 -0.099179 -0.043011 0.336604 0.587653 0.291692 -0.132343 -0.636247 0.013509 0.147208 -0.086167 -0.076750 0.084451 0.008538 0.019606
polarizability: 2.48645660e+02 -9.59164769e+00 1.96375815e+02 -2.54726041e+00 1.37797309e+00 7.09251202e+01
1716.lowfreq: -5.3610 0.0011 0.0014 0.0024 4.7803 11.7092 31.0290 56.4197 65.6136
frequency: 30.9436 56.4142 65.6132 91.3113 104.9078 127.9156 159.6999 174.3796 204.5551 260.5661 275.5653 283.7498 319.1378 357.8817 364.3332 375.2998 415.8179 420.2711 439.5145 466.6990 519.9458 537.1017 584.7227 652.6603 681.2403 701.3947 724.6861 752.6434 798.1178 803.3468 835.9462 843.3160 854.6679 901.4211 934.0728 986.9715 995.3159 1011.4234 1013.6132 1034.9680 1040.9126 1082.7400 1097.5973 1151.9972 1171.7922 1172.0478 1223.9773 1237.9541 1269.5826 1297.4004 1321.1910 1330.8364 1375.6353 1391.4598 1400.3171 1437.5964 1451.5812 1462.0796 1467.0872 1470.4588 1523.6478 1544.2747 1577.4180 1601.3873 1608.9724 2966.7140 2997.2541 3083.2241 3096.8960 3137.6897 3152.6954 3163.7033 3173.0145 3407.4591 3562.6039
redmass: 6.4341 3.9177 8.9608 5.3201 4.1089 4.9957 5.7037 6.5040 8.5612 2.9892 6.7860 5.2038 9.2455 2.0352 1.8442 8.5302 4.8244 4.3584 4.5419 8.9057 4.7179 5.0196 4.4685 5.4102 4.3485 7.1809 2.5277 1.3035 5.5219 1.7075 4.6387 2.7270 3.1219 3.4631 1.7771 4.6433 1.3931 1.6692 1.3607 2.1954 2.3194 2.7638 3.1066 2.1504 1.3460 1.0867 1.3446 2.2592 2.4132 3.0452 1.2835 1.3040 1.1996 6.2921 9.4817 2.3628 1.4803 1.0822 1.1574 2.4865 10.6208 10.5391 5.4944 6.9949 6.6875 1.0707 1.0657 1.0918 1.0999 1.0863 1.0903 1.0946 1.1002 1.0752 1.0663
irintensity: 1.3932 10.3926 1.2362 2.3713 1.6460 0.2525 3.7740 3.5171 2.7730 1.7401 1.3287 0.5136 5.6622 129.4504 92.4827 11.3293 5.0267 10.0519 3.6084 8.9248 17.6869 5.6238 4.2342 7.0347 9.4396 2.0560 89.8463 56.5149 77.8425 39.8365 4.0785 31.9503 5.2627 33.7249 0.1402 53.9531 4.4319 50.2323 0.5472 4.1363 6.6947 0.4894 32.5429 21.6723 36.6744 9.3309 47.7062 98.5198 126.6016 35.0343 14.9909 15.2838 6.3781 161.2031 2.7840 11.5330 12.8392 2.0270 38.2631 5.9294 98.4475 468.5042 243.0353 60.1687 79.1790 31.2260 75.6859 5.0214 26.4566 4.5847 6.0638 1.5296 25.9905 157.5023 9.8650
temp: 298.150 k
press: 1.00000 atm
elementType: 17 8 8 8 7 6 6 6 6 6 6 6 6 6 6 6 6 1 1 1 1 1 1 1 1 1 1
symmnumber: 1
zpe: 518062.9 jmol-1
zpe.correction: 0.197320 hartree
zpe.thermalcorrener: 0.212554 hartree
zpe.thermalcorrenthalpy: 0.213498 hartree
zpe.thermalcorrgfe: 0.153766 hartree
zpe.sumelectzpe: -1202.537441 hartree
zpe.sumelectthermal: -1202.522207 hartree
zpe.sumelectthermalent: -1202.521262 hartree
zpe.sumelectthermalfe: -1202.580995 hartree
dipole: 1.0230 -5.3146 -0.6874
dipole: 5.4557
quadrupole: -81.3410 -116.8417 -103.5047
quadrupole: -3.0713 -5.0987 -0.4838
quadrupole: 19.2215 -16.2792 -2.9422 -3.0713 -5.0987 -0.4838
hfenergy: -1202.7347608 hartree
pointgroup: C01 [X(C12H10Cl1N1O3)]
dipole: -0.4787045 -2.010189 0.5806402 debye
polarizability: 249.0668937|6.2877101|192.6551153|-8.3307643|-19.2587365|74.2245868 unknown
InChI: InChI=1S/C12H10ClNO3/c13-9-10(14-5-6-15)12(17)8-4-2-1-3-7(8)11(9)16/h1-4,14-15H,5-6H2
charge 0 multiplicity 1
27 atoms
Cl -1.562345 2.852366 -0.308924
O  -0.5296 -2.165887 0.544024
O  1.461614 2.892595 -0.401389
O  -5.106056 0.28363 0.450041
N  -2.354322 -0.01626 0.128392
C  1.397495 -0.76747 0.172888
C  -0.996513 0.16614 0.087008
C  1.909504 0.537785 -0.062216
C  -0.066178 -1.01039 0.281297
C  -0.434428 1.433809 -0.119585
C  0.990515 1.722408 -0.207674
C  -3.138471 -1.244841 0.342798
C  2.287538 -1.861928 0.312805
C  3.304423 0.737618 -0.155788
C  -4.581119 -0.970717 -0.120952
C  3.678914 -1.657761 0.215769
C  4.18738 -0.356145 -0.019134
H  -2.931332 0.837074 0.085142
H  -3.118382 -1.538562 1.413037
H  -2.710198 -2.088537 -0.220799
H  1.867174 -2.855635 0.496448
H  3.667556 1.754394 -0.3340
H  -5.225186 -1.837182 0.128022
H  -4.611478 -0.802118 -1.209629
H  4.365939 -2.503654 0.322099
H  5.268439 -0.196808 -0.093841
H  -5.285581 0.163078 1.417061
