program: Gaussian 09
title: 000097542
version: EM64L-G09RevD.01
frameworkgroup: C1[X(C14H11N3O5)]
method: RPBEPBE
basis: SDD
operation: Freq
keyword: #p
keyword: freq=noraman
keyword: PBEPBE/SDD
title: #p freq=noraman PBEPBE/SDD
converged: YES YES NO NO
title: Mulliken charges:
elementType: O O O O O N N N C C C C C C C C C C C C C C H H H H H H H H H H H
charge: -0.255961 -0.201793 -0.202962 -0.208604 -0.207242 0.021517 0.015362 0.026216 0.484875 -0.407935 -0.557112 -0.346481 0.387850 -0.182587 -0.364259 0.453060 0.382700 -0.353298 -0.341312 -0.352213 -0.348042 -0.347483 0.232278 0.237151 0.293993 0.257417 0.243378 0.291316 0.241575 0.275341 0.290037 0.289226 0.253993
chargesum: 0.00000
title: Mulliken charges with hydrogens summed into heavy atoms:
elementType: O O O O O N N N C C C C C C C C C C C C C C
charge: -0.255961 -0.201793 -0.202962 -0.208604 -0.207242 0.021517 0.015362 0.026216 0.484875 0.061494 -0.263119 -0.089065 0.387850 0.060791 -0.072943 0.453060 0.382700 -0.111723 -0.065972 -0.062175 -0.058815 -0.093490
polarizability: 4.23456923e+02 1.70367511e-01 1.68097101e+02 -8.03374613e+00 1.17451167e+01 1.11953585e+02
1716.lowfreq: -5.6578 -0.0004 -0.0003 0.0004 1.9414 3.1951 6.9770 14.2886 29.0968
frequency: 5.6432 13.2333 29.0813 43.1848 57.0605 67.8395 80.3321 105.2173 152.1284 162.2876 178.4067 191.9152 201.4039 219.2936 272.9749 308.6107 336.9700 341.9700 392.1887 411.8394 422.1001 446.6836 472.5669 499.3203 506.5324 519.8982 530.4759 609.3285 627.2470 655.3301 661.2004 666.6830 686.9693 702.7320 741.4400 762.8796 775.2502 817.2518 843.9275 848.2330 869.6821 890.3220 906.2877 918.9503 951.9880 955.3083 974.2765 989.8821 991.4696 1002.6307 1002.7227 1005.0888 1009.4063 1088.5276 1091.0901 1092.6530 1111.2803 1176.0794 1177.6647 1183.9778 1210.2729 1217.2752 1228.4778 1232.8338 1294.0358 1298.9231 1326.5512 1352.0801 1362.1612 1373.8747 1399.9027 1404.5064 1419.2250 1436.5892 1476.8933 1480.6419 1483.5180 1549.3893 1591.5213 1592.4272 1610.0335 1621.1904 2996.4478 3059.5774 3069.1215 3141.6534 3147.0149 3163.8733 3165.6173 3169.0166 3184.5383 3187.2128 3187.3660
redmass: 6.0870 8.0230 6.9805 6.8288 11.1468 7.1269 6.6966 6.2475 7.1595 5.2650 4.3468 7.4891 7.3266 4.0885 6.0243 5.3384 6.0774 5.2913 7.8565 2.9162 3.2128 5.0629 8.5031 5.9055 3.2402 6.1034 5.7692 6.2170 7.0826 7.7937 6.3753 4.5989 3.1964 3.9093 4.3972 8.3614 8.3793 1.5613 4.5621 1.2952 1.4800 4.3312 5.9148 1.4215 1.4891 1.4031 6.8830 5.8796 1.3768 2.9515 1.3931 1.3571 1.8511 1.8580 1.6093 3.2377 1.3115 1.1394 1.3664 1.1043 4.4862 3.9730 2.0679 3.3903 1.3649 1.3260 1.6301 1.9528 4.6527 10.7403 7.5549 5.8830 4.3900 2.6566 1.3009 2.4389 2.1409 6.6723 7.4094 6.7331 6.2994 6.9163 1.0570 1.1074 1.0899 1.0906 1.0880 1.0896 1.0943 1.0927 1.0948 1.0969 1.0965
irintensity: 1.6788 2.2208 0.3783 0.8889 0.0460 0.0081 1.8301 5.2784 0.2992 1.7022 9.8475 0.9094 2.1411 2.7005 6.4700 1.8972 2.9989 0.9653 0.3974 0.0559 1.0058 2.2682 15.8297 12.3900 15.2533 11.1906 7.2898 28.8133 3.4748 5.4853 18.4042 27.3592 15.2714 35.8625 1.2331 19.9730 52.8979 41.4513 1.7808 8.0634 36.3638 14.7156 384.6445 17.6824 42.5979 13.6335 285.6589 2.9166 0.1345 0.1511 0.6024 0.0958 3.1315 22.3712 23.8980 20.9944 16.1959 46.0873 100.2683 9.0534 277.6401 381.1590 11.7196 90.0149 5.1347 0.0683 31.2863 33.3530 82.5525 123.7119 30.5461 6.9894 38.2807 14.7720 40.0031 0.7530 6.2351 56.1743 17.3566 5.6132 70.5227 1.1670 39.5645 15.6912 11.7373 8.0363 7.2368 0.8792 5.3110 5.2723 0.4410 4.6253 1.9493
temp: 298.150 k
press: 1.00000 atm
elementType: 8 8 8 8 8 7 7 7 6 6 6 6 6 6 6 6 6 6 6 6 6 6 1 1 1 1 1 1 1 1 1 1 1
symmnumber: 1
zpe: 611236.0 jmol-1
zpe.correction: 0.232808 hartree
zpe.thermalcorrener: 0.252036 hartree
zpe.thermalcorrenthalpy: 0.252980 hartree
zpe.thermalcorrgfe: 0.179726 hartree
zpe.sumelectzpe: -1078.685773 hartree
zpe.sumelectthermal: -1078.666545 hartree
zpe.sumelectthermalent: -1078.665600 hartree
zpe.sumelectthermalfe: -1078.738854 hartree
dipole: -1.4961 3.3822 -1.1218
dipole: 3.8648
quadrupole: -221.8842 -119.5658 -123.9129
quadrupole: -9.8454 15.3704 2.6057
quadrupole: -66.7632 35.5551 31.2081 -9.8454 15.3704 2.6057
hfenergy: -1078.9185804 hartree
pointgroup: C01 [X(C14H11N3O5)]
dipole: -0.6294121 0.9068823 1.0456405 debye
polarizability: 423.138144|12.1050918|112.1686703|3.3042811|11.7671619|168.2007946 unknown
InChI: InChI=1S/C14H11N3O5/c18-16(19)13-6-4-11(5-7-13)9-15-22-10-12-2-1-3-14(8-12)17(20)21/h1-9H,10H2
charge 0 multiplicity 1
33 atoms
O  -0.855541 0.006019 0.192926
O  -7.881192 -0.522666 -0.284361
O  -6.514334 -1.575214 -1.775828
O  7.823613 -0.116482 0.764645
O  7.473327 0.583782 -1.37984
N  -6.723353 -0.745478 -0.808881
N  0.499015 0.161175 -0.307786
N  7.049757 0.197332 -0.221736
C  -3.172375 0.472191 -0.319341
C  -1.800707 0.272119 -0.925832
C  -4.283106 -0.235774 -0.824945
C  -3.36046 1.391161 0.746988
C  -5.557552 0.000079 -0.266074
C  -4.642965 1.604058 1.29772
C  -5.762401 0.910071 0.791602
C  2.807415 -0.051824 0.385073
C  5.585828 0.109341 -0.011847
C  3.708203 -0.387457 1.435778
C  3.331699 0.366241 -0.874574
C  5.099251 -0.309172 1.245611
C  4.717297 0.447903 -1.077252
C  1.364486 -0.147494 0.636568
H  -1.784331 -0.582301 -1.626359
H  -1.446881 1.17547 -1.457368
H  -4.184737 -0.963313 -1.636189
H  -2.493805 1.927008 1.148272
H  -4.773107 2.312828 2.121556
H  -6.76869 1.054823 1.193001
H  3.312274 -0.710848 2.405166
H  2.636538 0.622062 -1.67948
H  5.807122 -0.56151 2.039166
H  5.14317 0.765271 -2.032607
H  1.023443 -0.481301 1.62943
