program: Gaussian 09
title: 000097501
version: EM64L-G09RevD.01
frameworkgroup: C1[X(C8H20N2)]
method: RPBEPBE
basis: SDD
operation: Freq
keyword: #pfreq=noraman
keyword: PBEPBE/SDD
title: #p freq=noraman PBEPBE/SDD
converged: YES YES NO NO
title: Mulliken charges:
elementType: N N C C C C C C C C H H H H H H H H H H H H H H H H H H H H
charge: -0.298955 -0.298955 -0.041931 -0.041962 -0.347908 -0.347885 -0.691492 -0.702815 -0.691484 -0.702807 0.180128 0.180127 0.177002 0.220419 0.176997 0.220412 0.226865 0.226864 0.199293 0.203004 0.245496 0.207578 0.213743 0.209575 0.199297 0.203005 0.245491 0.207578 0.213742 0.209577
chargesum: 0.00000
title: Mulliken charges with hydrogens summed into heavy atoms:
elementType: N N C C C C C C C C
charge: -0.072090 -0.072091 0.138198 0.138165 0.049513 0.049524 -0.043698 -0.071920 -0.043692 -0.071910
polarizability: 1.29509503e+02 -2.07462163e+00 9.46974549e+01 -3.45911102e-04 -1.30370485e-04 9.05655165e+01
1716.lowfreq: -22.2654 -6.2984 -5.2310 -0.0003 0.0004 0.0008 25.1901 27.9496 48.6243
frequency: 24.8010 27.9344 48.1687 94.4600 147.4159 169.3449 178.2808 197.0417 198.6172 227.7032 232.8540 247.5779 304.5559 341.6149 395.8993 400.9690 429.1571 477.7400 513.1742 696.7575 736.1886 825.7521 827.2902 908.4988 915.7845 918.6340 923.4245 941.0787 945.7778 965.0080 965.3346 1019.2025 1073.1384 1124.7909 1137.6167 1165.5069 1167.5707 1173.0017 1180.0571 1185.7293 1222.6522 1231.4868 1294.3894 1299.1137 1333.5256 1334.0201 1352.6841 1353.8268 1372.0158 1372.1856 1389.8052 1390.7533 1424.5703 1461.5790 1461.8364 1468.2322 1468.8992 1476.3511 1478.5333 1478.5710 1488.1254 1488.1355 1489.9101 1495.1359 2860.0815 2860.2279 2939.2106 2939.2696 2967.0219 2967.0781 2971.4750 2971.8517 3036.2014 3036.7979 3058.3050 3058.3382 3065.3614 3065.7240 3070.6486 3070.6529 3087.2328 3087.3290 3278.0309 3287.0393
redmass: 2.5072 3.2762 3.1043 2.3341 1.9676 2.1478 2.6699 1.0750 1.1068 1.1030 1.2764 2.5474 2.6781 2.2761 2.3395 2.1288 2.0289 2.7665 3.5237 1.4722 1.3998 2.6867 2.4905 1.2936 1.2050 1.2169 1.3520 1.5141 1.4693 1.6457 1.6939 2.0742 2.9046 2.2377 2.2438 2.7366 2.0859 2.0882 1.7640 2.1518 1.3055 1.2445 1.2537 1.3092 1.4575 1.4555 1.4362 1.4260 1.2170 1.2176 1.2127 1.2176 1.1487 1.0547 1.0541 1.0599 1.0504 1.1282 1.0620 1.0472 1.0610 1.0842 1.0562 1.1227 1.0713 1.0720 1.0825 1.0825 1.0354 1.0354 1.0363 1.0363 1.0884 1.0887 1.0995 1.0995 1.0988 1.0987 1.0991 1.0992 1.0992 1.0992 1.0723 1.0755
irintensity: 0.0097 0.0829 0.6024 1.4027 1.0812 11.5700 0.2990 0.2510 0.5024 1.6902 0.0132 0.1261 7.3343 0.7749 0.3637 0.0229 1.6219 4.6491 4.0802 26.1583 122.9568 1.0002 2.8109 0.2513 4.3999 0.0762 36.5523 1.8514 0.5395 2.9041 1.9513 2.5008 23.4694 0.2652 3.5868 0.0112 0.1350 9.7544 16.6125 1.9709 2.5653 2.8578 3.8240 0.0351 4.2377 2.2882 1.3544 0.0084 29.6356 13.0516 21.2866 17.4970 1.5805 11.1846 0.0524 0.1164 0.5483 20.2109 0.2252 24.5987 19.9791 0.0619 1.6923 14.8816 196.5442 41.0150 12.5592 51.7447 73.6281 4.9277 28.7657 38.4892 2.8433 28.5797 14.5061 16.5841 34.4023 123.0004 0.4684 122.4787 52.7262 3.8084 54.9532 23.4744
temp: 298.150 k
press: 1.00000 atm
elementType: 7 7 6 6 6 6 6 6 6 6 1 1 1 1 1 1 1 1 1 1 1 1 1 1 1 1 1 1 1 1
symmnumber: 1
zpe: 716309.9 jmol-1
zpe.correction: 0.272828 hartree
zpe.thermalcorrener: 0.286783 hartree
zpe.thermalcorrenthalpy: 0.287727 hartree
zpe.thermalcorrgfe: 0.231097 hartree
zpe.sumelectzpe: -425.442139 hartree
zpe.sumelectthermal: -425.428184 hartree
zpe.sumelectthermalent: -425.427240 hartree
zpe.sumelectthermalfe: -425.483870 hartree
dipole: -0.0002 -0.0003 -1.7940
dipole: 1.7940
quadrupole: -64.2976 -67.0986 -62.4393
quadrupole: -0.3487 0.0000 0.0009
quadrupole: 0.3142 -2.4867 2.1725 -0.3487 0.0000 0.0009
hfenergy: -425.7149671 hartree
pointgroup: C01 [X(C8H20N2)]
dipole: -0.0001038 -0.0000612 0.7058331 debye
polarizability: 129.4272007|2.6762661|94.7797572|0.0014013|0.0010306|90.5655168 unknown
InChI: InChI=1S/C8H20N2/c1-7(2)5-9-10-6-8(3)4/h7-10H,5-6H2,1-4H3
charge 0 multiplicity 1
30 atoms
N  0.645533 -0.315878 0.698174
N  -0.645487 0.315958 0.698116
C  3.085886 -0.160676 0.197562
C  -3.085859 0.16067 0.197577
C  1.748989 0.606868 0.353144
C  -1.748868 -0.606775 0.352819
C  3.037637 -1.129307 -1.006065
C  4.261885 0.835737 0.073989
C  -3.037806 1.129744 -1.005705
C  -4.261737 -0.835847 0.073695
H  3.244229 -0.761218 1.121448
H  -3.244238 0.760854 1.121691
H  1.88225 1.420934 1.110379
H  1.47782 1.094447 -0.601119
H  -1.882002 -1.421103 1.109794
H  -1.47772 -1.094019 -0.601623
H  0.849263 -0.846766 1.566874
H  -0.84936 0.846729 1.566854
H  2.978141 -0.560894 -1.954596
H  3.942867 -1.763718 -1.046653
H  2.147408 -1.778801 -0.943817
H  4.130326 1.486771 -0.811913
H  5.222188 0.30054 -0.043145
H  4.339112 1.486911 0.965228
H  -2.978261 0.561681 -1.954443
H  -3.94314 1.764026 -1.046028
H  -2.147676 1.779356 -0.943277
H  -4.130123 -1.486541 -0.812449
H  -5.222113 -0.30073 -0.043211
H  -4.338844 -1.487352 0.964701
