program: Gaussian 09
title: 000097490
version: EM64L-G09RevD.01
frameworkgroup: C1[X(C11H9NO)]
method: RPBEPBE
basis: SDD
operation: Freq
keyword: #p
keyword: freq=noraman
keyword: PBEPBE/SDD
title: #p freq=noraman PBEPBE/SDD
converged: NO NO NO NO
title: Mulliken charges:
elementType: O N C C C C C C C C C C C H H H H H H H H H
charge: -0.221572 -0.420336 0.136055 -0.516107 -0.001622 -0.497464 0.167498 0.081376 0.254008 -0.398132 -0.360124 -0.247689 -0.208214 0.240884 0.240889 0.249317 0.249324 0.321968 0.239609 0.238471 0.225593 0.226269
chargesum: 0.00000
title: Mulliken charges with hydrogens summed into heavy atoms:
elementType: O N C C C C C C C C C C C
charge: -0.221572 -0.098368 0.136055 -0.034333 -0.001622 0.001177 0.167498 0.081376 0.254008 -0.158524 -0.121653 -0.022097 0.018054
polarizability: 2.08917088e+02 -7.33466600e+00 1.29691501e+02 -2.75179375e-03 -1.32238296e-04 5.74940708e+01
1716.lowfreq: -0.0004 0.0001 0.0006 1.8511 3.5207 11.4265 88.2946 104.6112 150.1738
frequency: 88.2734 104.5612 150.1683 187.7679 259.3654 308.9081 331.4823 427.7918 465.3956 521.4168 531.0973 563.1715 575.0683 587.9367 625.6812 656.5939 656.6612 751.6485 756.0449 760.8744 820.9962 825.4964 857.9197 921.0705 941.6540 968.8314 979.2631 996.0142 1010.2305 1023.6921 1092.0012 1132.8850 1133.7449 1169.6529 1186.5673 1226.5000 1231.5264 1242.2704 1274.4479 1324.4903 1379.8295 1401.1778 1431.3837 1448.7724 1463.6819 1470.8523 1490.2748 1548.9918 1577.3860 1627.5074 1632.6635 2992.0645 3021.6157 3037.2261 3082.3865 3127.8558 3137.0809 3149.9335 3165.2212 3607.7980
redmass: 7.8229 2.1367 2.5319 5.9559 5.1944 3.9705 6.6114 2.9591 5.1595 3.2552 5.6609 1.1708 3.2487 5.5736 7.0618 5.9196 2.8845 5.7841 1.2846 3.9335 5.1692 1.6430 1.5003 6.8019 1.3788 2.8438 1.3117 2.0079 2.0517 4.3569 4.2180 1.1813 1.7489 1.1244 1.1136 1.4346 1.5936 1.8731 1.6373 2.0603 3.1842 2.9888 1.1101 4.6558 1.1980 4.1716 3.4440 6.4807 6.0725 7.5408 12.1192 1.0595 1.0607 1.1029 1.1025 1.0850 1.0892 1.0957 1.1003 1.0807
irintensity: 1.0129 4.1744 2.0417 4.1493 4.7336 3.3567 2.6854 9.4604 16.4343 0.2244 2.6445 97.1290 6.9054 2.5024 2.5643 1.2324 0.8436 5.2471 121.7487 0.2665 4.8472 2.4200 0.3929 0.7208 2.4230 4.7150 0.0449 1.5406 7.0755 42.1620 28.0916 0.0147 19.5199 5.5898 0.0440 58.8520 15.8444 5.4801 12.1369 73.7093 3.0997 2.9386 16.6097 11.4049 11.9921 16.3719 4.4835 18.2725 5.6995 46.2172 523.8975 29.9094 20.4958 10.9305 14.0548 0.0187 3.2248 28.0459 29.6913 78.5232
temp: 298.150 k
press: 1.00000 atm
elementType: 8 7 6 6 6 6 6 6 6 6 6 6 6 1 1 1 1 1 1 1 1 1
symmnumber: 1
zpe: 451368.2 jmol-1
zpe.correction: 0.171917 hartree
zpe.thermalcorrener: 0.181595 hartree
zpe.thermalcorrenthalpy: 0.182539 hartree
zpe.thermalcorrgfe: 0.136712 hartree
zpe.sumelectzpe: -553.661392 hartree
zpe.sumelectthermal: -553.651714 hartree
zpe.sumelectthermalent: -553.650770 hartree
zpe.sumelectthermalfe: -553.696596 hartree
dipole: -2.8287 1.4843 0.0001
dipole: 3.1944
quadrupole: -81.0224 -65.4878 -78.0613
quadrupole: 11.4558 -0.0011 0.0008
quadrupole: -6.1652 9.3694 -3.2041 11.4558 -0.0011 0.0008
hfenergy: -553.8333088 hartree
pointgroup: C01 [X(C11H9N1O1)]
dipole: 1.1236148 0.5630372 -0.000037 debye
dipolederiv: -1.192181 -0.3375318 -0.0000293 -0.62788 -0.8671005 -0.0000205 -0.0000949 -0.0000245 -0.3428514 -0.4636291 0.1097857 0.0000005 -0.1882149 -0.5396555 -0.0000057 -0.0000092 -0.0000314 -0.2684565 0.4373256 -0.2391747 0.0000154 0.1948202 0.1242768 -0.0000473 -0.0000418 -0.0001259 -0.1170013 -0.0165895 -0.03955 -0.0000259 -0.0179995 0.0082463 0.0000385 -0.0000466 0.0000826 0.1892341 -1.2140129 -0.4620423 -0.0000309 -0.3637894 0.2762207 0.0000432 -0.0000801 0.0000502 0.0314253 -0.0698419 0.1660995 -0.0000149 0.1050597 -0.3533656 0.0000134 0.0000362 0.0000263 0.105777 -0.1276163 0.1912598 -0.0000122 -0.0724297 -0.1790732 0.0000264 0.0000322 0.000022 0.0083152 2.0844968 0.4123637 0.0001093 0.2974476 1.0335822 -0.0000061 0.0001952 0.0000051 0.1250218 0.2686404 0.213964 -0.0000282 0.3546604 0.0820079 -0.0000056 -0.0000125 -0.0000068 0.0567376 0.2407223 -0.0715554 -0.0000328 0.1080364 0.0944857 0.0000109 -0.0000335 0.0000364 -0.1543457 -0.0062546 -0.1311048 -0.0000249 -0.0562407 0.0469832 -0.0000019 -0.000022 -0.0000105 -0.1968181 -0.1376427 0.1421293 -0.0000142 0.2784731 -0.0548889 -0.0000157 -0.0000114 -0.0000188 -0.1841272 -0.0604857 -0.0134945 -0.0000228 -0.172982 0.1288696 0.000017 -0.0000124 0.0000104 -0.160255 0.0471455 0.0143074 -0.0136169 0.0136244 -0.0291337 -0.0906438 0.0077093 -0.1402475 -0.0347102 0.0471273 0.0142739 0.0136563 0.0135907 -0.0290621 0.0906149 -0.0076827 0.1402359 -0.0347763 0.0178183 -0.0041712 -0.0784361 0.0356326 0.0716275 0.028915 -0.1287458 0.0424778 -0.0166452 0.0177863 -0.0041642 0.0784407 0.0356718 0.0716195 -0.0289188 0.1287317 -0.0424857 -0.016622 0.1561397 0.0235782 0.0000059 0.0537866 0.2364202 -0.0000025 0.0000159 0.0000142 0.3474312 0.0860553 0.0425554 0.0000099 -0.0078911 -0.0914326 -0.0000102 0.0000125 -0.0000181 0.1569599 0.0704052 -0.0053763 0.0000089 0.0513901 -0.0982621 -0.0000001 0.0000096 0.0000074 0.1778501 -0.0780783 -0.1011345 0.0000179 -0.1111677 0.0089218 0.0000078 0.0000235 0.0000079 0.166171 -0.1073307 0.0789828 0.0000243 0.0764016 0.0587125 -0.0000089 0.0000268 -0.000007 0.1616857 unknown
polarizability: 209.163695|5.8479851|129.4448945|-0.0027488|0.0001837|57.4940708 unknown
InChI: InChI=1S/C11H9NO/c13-10-6-5-8-7-3-1-2-4-9(7)12-11(8)10/h1-4,12H,5-6H2
charge 0 multiplicity 1
22 atoms
O  -3.492704 -1.370873 -0.000248
N  -0.227439 -1.489745 -0.000019
C  -0.596997 0.773723 0.00002
C  -1.626425 1.880236 -0.000228
C  -1.197206 -0.488577 0.000027
C  -2.992178 1.097578 -0.000263
C  0.829597 0.571125 -0.000021
C  -2.657213 -0.423652 -0.000168
C  1.031969 -0.868765 -0.000062
C  1.965612 1.427054 -0.000125
C  2.323448 -1.442189 -0.000206
C  3.250189 0.853749 -0.000249
C  3.425352 -0.563791 -0.000291
H  -1.53725 2.533547 0.887806
H  -1.537017 2.533233 -0.88847
H  -3.604861 1.328985 -0.88968
H  -3.604937 1.329084 0.889075
H  -0.405728 -2.491954 0.000011
H  1.842571 2.515524 -0.000072
H  2.469672 -2.527727 -0.000215
H  4.133819 1.501393 -0.000326
H  4.440024 -0.977757 -0.000396
