program: Gaussian 09
title: 000097464
version: EM64L-G09RevD.01
frameworkgroup: C1[X(C7H7ClN2O2)]
method: RPBEPBE
basis: SDD
operation: Freq
keyword: #p
keyword: freq=noraman
keyword: PBEPBE/SDD
title: #p freq=noraman PBEPBE/SDD
converged: YES YES NO NO
title: Mulliken charges:
elementType: Cl O O N N C C C C C C C H H H H H H H
charge: -0.059094 -0.337684 -0.395679 -0.468164 -0.328780 0.489105 -0.430766 -0.322940 -0.184229 -0.194909 -0.121876 0.297909 0.224186 0.312753 0.307026 0.255860 0.255859 0.313668 0.387753
chargesum: 0.00000
title: Mulliken charges with hydrogens summed into heavy atoms:
elementType: Cl O O N N C C C C C C C
charge: -0.059094 -0.337684 -0.007926 -0.161137 -0.015112 0.489105 -0.206580 -0.010187 0.071632 0.060950 -0.121876 0.297909
polarizability: 1.95206888e+02 -2.64751734e+00 1.03221050e+02 2.93210470e-01 4.21604144e-01 4.16032884e+01
1716.lowfreq: -7.1655 -0.0021 -0.0019 -0.0010 2.9249 11.8167 46.0999 58.8200 104.4891
frequency: 46.0791 58.7110 104.4875 128.4249 162.8231 229.7867 260.4628 302.6890 318.9686 353.4059 374.1255 411.6123 426.8528 446.9160 499.8727 567.8489 621.8228 657.4367 675.9942 701.3898 763.4817 810.4998 825.1375 844.8942 935.3051 961.7477 979.2060 993.1382 1038.2587 1075.6885 1118.3331 1188.0505 1213.6272 1258.1502 1297.8381 1321.9186 1376.9196 1403.0412 1468.3736 1480.6427 1526.2773 1596.4174 1607.6636 1616.5324 3121.0829 3165.9111 3172.0676 3192.5133 3252.9211 3528.4452 3542.3146
redmass: 8.7211 4.7821 8.4837 7.6958 4.0401 7.5625 11.4181 2.6257 5.2142 2.4343 4.8440 3.0177 1.2272 5.9005 2.4470 1.3284 6.8934 6.8778 6.3317 3.5500 5.0376 1.4094 5.6791 1.3920 1.3528 5.7215 1.3141 4.3538 6.5138 2.5458 1.3408 1.1140 1.6676 2.0443 1.3533 1.7316 4.8300 3.8468 1.5593 2.3436 2.4037 5.9153 5.2685 3.9026 1.0901 1.0909 1.0952 1.0958 1.0640 1.0761 1.0800
irintensity: 0.5982 7.0022 3.4857 0.7303 5.4426 7.3773 1.0093 195.6219 26.7231 93.8417 21.4544 0.4081 91.1389 48.4421 93.1323 82.7816 0.4047 10.7250 31.9022 0.1888 18.5657 43.8900 14.0665 62.5677 1.0555 60.1780 3.3509 23.2002 38.7986 30.1897 13.7901 4.7396 9.9556 54.4638 1.3365 185.7216 236.9747 53.2391 89.6234 171.0025 471.5799 49.0854 49.0537 73.5487 16.2063 2.6152 2.4660 6.7123 31.2740 13.6325 55.5085
temp: 298.150 k
press: 1.00000 atm
elementType: 17 8 8 7 7 6 6 6 6 6 6 6 1 1 1 1 1 1 1
symmnumber: 1
zpe: 353054.5 jmol-1
zpe.correction: 0.134471 hartree
zpe.thermalcorrener: 0.145914 hartree
zpe.thermalcorrenthalpy: 0.146858 hartree
zpe.thermalcorrgfe: 0.096139 hartree
zpe.sumelectzpe: -990.040523 hartree
zpe.sumelectthermal: -990.029080 hartree
zpe.sumelectthermalent: -990.028136 hartree
zpe.sumelectthermalfe: -990.078855 hartree
dipole: -0.8105 3.8146 0.8749
dipole: 3.9966
quadrupole: -92.6949 -65.0921 -80.1738
quadrupole: -6.3486 -3.8039 0.8610
quadrupole: -13.3746 14.2281 -0.8535 -6.3486 -3.8039 0.8610
hfenergy: -990.1749944 hartree
pointgroup: C01 [X(C7H7Cl1N2O2)]
dipole: -0.2429536 -1.5031858 -0.3922373 debye
dipolederiv: -0.898149 -0.1617148 0.0386715 -0.1899444 -0.1666894 0.0076994 0.0395867 0.0067902 -0.0710071 -0.773057 0.0405839 -0.0059378 0.2060998 -0.9395129 -0.0482487 -0.0546692 -0.0634254 -0.3655549 -0.5999367 -0.0233416 0.038631 0.2975393 -0.1774387 -0.0225606 -0.0957545 0.0078858 -0.386848 -2.1311355 0.0555359 0.0622766 0.458676 -0.304437 -0.073501 0.0552415 -0.0413691 -0.335537 -0.7481489 -0.2502733 0.0235748 -1.0326246 -0.3960232 0.1777315 0.3554778 0.2190661 -0.2601919 1.5028839 0.1818677 -0.065225 0.4876795 0.0244069 -0.0138096 -0.0502787 -0.0134401 0.0974068 -0.2924727 -0.0578964 0.0011773 0.1270625 0.0725699 0.0012994 0.0052155 0.0080481 -0.2096344 -0.2430282 -0.0021672 -0.0005956 -0.2349348 -0.048826 0.0113161 -0.0021972 0.0065528 -0.1584944 -0.1621129 -0.0300234 0.0028432 -0.1308266 0.0302978 0.0099092 0.0009067 0.0056505 -0.090404 -0.1746701 -0.0555725 0.0041376 0.0075539 0.0745503 0.0046972 0.0056583 0.0091907 -0.094049 1.1336167 0.2678916 -0.0588473 0.3016596 0.0755423 -0.0121951 -0.0586609 -0.0115875 -0.0877459 2.3459285 0.0928068 -0.0478431 -0.4088659 1.2044953 0.0736509 0.0082595 0.0645198 0.2653458 0.0299255 -0.0995481 0.0053382 -0.0792153 -0.0841592 -0.0019636 0.0039504 -0.0014227 0.1703619 0.1541303 0.0490331 0.0045537 0.034632 0.0822956 -0.0032791 -0.000239 -0.0067866 0.1835461 0.1129548 0.0108273 0.014462 -0.0128323 0.1184063 0.0036155 -0.0063817 0.0097445 0.3304991 0.0191626 0.0750577 0.0091755 0.0725768 0.0296721 -0.0068201 0.01019 -0.0067252 0.165362 0.0779793 -0.0419745 0.0037472 -0.0483558 -0.0247636 -0.0018907 0.0038425 -0.0025958 0.1604294 0.1872367 0.0723613 -0.0073601 0.2045948 0.2242624 -0.091175 -0.1673448 -0.1653821 0.3008364 0.4588928 -0.1234535 -0.0227797 -0.0604745 0.2053512 -0.0144757 -0.0528028 -0.0247141 0.3856789 unknown
polarizability: 194.3043049|8.3126805|103.760637|-6.0833276|2.43693|41.9662848 unknown
InChI: InChI=1S/C7H7ClN2O2/c8-5-1-3-6(4-2-5)9-7(11)10-12/h1-4,9-10,12H
charge 0 multiplicity 1
19 atoms
Cl 4.648798 0.661723 -0.150498
O  -2.358388 1.186939 0.309053
O  -4.730314 0.062221 0.12766
N  -1.202604 -0.890976 0.120528
N  -3.550545 -0.783425 0.160207
C  0.156165 -0.470311 0.062167
C  1.15017 -1.483338 -0.011943
C  0.545084 0.895984 0.074965
C  2.516957 -1.145707 -0.074923
C  1.91366 1.232251 0.007612
C  2.882521 0.21414 -0.066197
C  -2.335242 -0.083134 0.18093
H  0.861265 -2.541969 -0.022312
H  -0.216867 1.674411 0.144852
H  -1.351447 -1.901061 0.176726
H  3.279379 -1.927677 -0.131119
H  2.217597 2.282945 0.017189
H  -3.719726 -1.620925 -0.402352
H  -4.320063 0.98181 0.238257
