program: Gaussian 09
title: 000097443
version: EM64L-G09RevD.01
frameworkgroup: C1[X(C8H3N3O2)]
method: RPBEPBE
basis: SDD
operation: Freq
keyword: #pfreq=noraman
keyword: PBEPBE/SDD
title: #p freq=noraman PBEPBE/SDD
converged: YES YES NO NO
title: Mulliken charges:
elementType: O O N N N C C C C C C C C H H H
charge: -0.184860 -0.182178 0.026531 0.023187 0.027086 0.420871 -0.494486 0.312880 -0.346734 0.288356 -0.340815 -0.225695 -0.227414 0.319530 0.303804 0.279937
chargesum: 0.00000
title: Mulliken charges with hydrogens summed into heavy atoms:
elementType: O O N N N C C C C C C C C
charge: -0.184860 -0.182178 0.026531 0.023187 0.027086 0.420871 -0.174956 0.312880 -0.042930 0.288356 -0.060878 -0.225695 -0.227414
polarizability: 1.79795641e+02 4.65253816e+00 1.26168242e+02 -3.65484499e-03 7.06819480e-03 4.15405065e+01
1716.lowfreq: -4.6055 -1.5917 -0.0009 -0.0003 0.0003 7.0701 53.2323 78.6529 109.7179
frequency: 53.2306 78.6506 109.7178 136.8146 137.8117 222.5707 252.1213 322.6911 378.4051 404.6494 411.1931 480.3904 506.0611 545.1514 571.4317 594.4905 638.6986 704.5166 712.9011 741.8160 770.3337 873.1064 889.0216 957.9524 1003.6172 1072.0165 1120.1002 1178.0130 1204.3163 1221.8807 1265.9940 1371.5258 1378.5463 1413.0084 1469.1791 1575.0781 1603.1008 2187.1755 2192.8150 3173.2539 3187.5019 3192.5126
redmass: 15.3200 9.5855 13.6594 12.4051 6.1049 8.5358 8.1908 13.0728 6.6130 4.4375 12.6018 11.5891 8.8280 4.7443 6.2815 8.2035 6.8683 6.2981 6.6667 11.6182 3.9953 1.4656 7.2998 1.4876 1.3709 2.2422 2.2807 2.0976 5.6619 4.9223 1.3532 10.8624 6.8129 5.6619 2.7733 8.1967 7.0096 12.6291 12.6316 1.0904 1.0935 1.0973
irintensity: 0.0425 8.2062 0.7279 8.5113 2.3667 0.0001 0.2832 0.3836 0.0262 0.0967 0.1022 0.3692 1.4583 8.0844 0.6563 2.7885 3.0776 18.5626 2.8461 30.1074 0.3981 40.0672 9.5465 26.5786 0.0444 25.7042 8.9121 5.6780 179.2431 77.9854 6.2828 55.7585 14.1796 65.5315 19.9694 3.2746 4.7032 0.0287 0.7748 1.6964 8.6341 4.7536
temp: 298.150 k
press: 1.00000 atm
elementType: 8 8 7 7 7 6 6 6 6 6 6 6 6 1 1 1
symmnumber: 1
zpe: 253030.3 jmol-1
zpe.correction: 0.096374 hartree
zpe.thermalcorrener: 0.107075 hartree
zpe.thermalcorrenthalpy: 0.108019 hartree
zpe.thermalcorrgfe: 0.058918 hartree
zpe.sumelectzpe: -620.351561 hartree
zpe.sumelectthermal: -620.340861 hartree
zpe.sumelectthermalent: -620.339917 hartree
zpe.sumelectthermalfe: -620.389017 hartree
dipole: -1.6703 -3.0247 0.0003
dipole: 3.4552
quadrupole: -108.9604 -74.4470 -71.8960
quadrupole: -1.4756 0.0007 -0.0054
quadrupole: -23.8593 10.6542 13.2051 -1.4756 0.0007 -0.0054
hfenergy: -620.4479355 hartree
pointgroup: C01 [X(C8H3N3O2)]
dipole: 0.6580411 1.1895011 0.0001162 debye
dipolederiv: -0.7823377 -0.1899123 -0.0000041 -0.1172395 -0.5732507 -0.0000259 0.0000189 -0.0000093 -0.2106063 -0.6465424 0.1519159 0.0000152 0.1459403 -0.6853798 -0.0000071 0.0000331 -0.0000525 -0.2088716 1.7640309 -0.0651573 -0.000028 -0.1440574 1.0740229 0.0000327 -0.0000507 0.0000687 0.1902052 -0.1525994 0.0165668 -0.0002886 0.0018327 -0.1723083 -0.0003296 -0.000167 -0.0002099 -0.2062077 -0.0916512 0.0047187 0.0003473 0.0016886 -0.1827243 -0.0000776 0.0002852 -0.0000686 -0.2058299 -0.5038218 0.1081811 0.0000107 0.1651927 0.0235496 0.0000149 0.0000465 0.0000177 0.0770342 0.0277887 -0.1426111 -0.0000078 0.048145 -0.0812393 0.0000238 -0.0000535 -0.0000646 -0.0847873 0.0428069 0.1412713 0.0000448 0.1096887 0.13867 0.0000065 0.0000877 -0.0000394 0.120579 0.1290941 0.1220744 0.0000202 -0.1969668 -0.0713725 0.000005 -0.0000475 -0.0000116 -0.0856208 0.2600995 -0.0544406 -0.000022 -0.0196138 0.2379348 -0.0000067 -0.0000489 -0.0000616 0.130048 -0.3054649 -0.1520841 -0.0000358 -0.0738871 0.1015962 0.0000515 0.0000634 -0.0000017 -0.1124291 0.003656 0.060689 0.0002368 0.0401904 0.0029239 0.0002751 0.0002858 0.0003484 0.035084 -0.0679518 -0.0220306 -0.0002813 0.0307893 -0.0288164 0.0000628 -0.0004485 0.0001133 0.0417839 0.1451234 0.0265913 -0.0000125 -0.0088773 0.0936549 -0.0000074 -0.0000168 -0.0000204 0.1797712 0.108497 -0.0451068 -0.0000111 -0.0150984 0.1109959 -0.0000087 -0.0000202 0.0000043 0.1760169 0.0692728 0.0393343 0.0000163 0.0322724 0.0117433 -0.0000093 0.0000325 -0.0000128 0.1638302 unknown
polarizability: 179.8027468|4.6113988|126.1611365|0.0036494|-0.007071|41.5405065 unknown
InChI: InChI=1S/C8H3N3O2/c9-4-6-1-2-8(11(12)13)3-7(6)5-10/h1-3H
charge 0 multiplicity 1
16 atoms
O  3.760422 0.834417 0.00001
O  3.287486 -1.399376 -0.000098
N  2.940186 -0.159037 0.000019
N  -2.555613 -2.607561 0.000846
N  -3.823736 1.338822 -0.000807
C  1.481337 0.152045 0.000054
C  0.56613 -0.915871 -0.000091
C  -0.819615 -0.627255 -0.000078
C  1.072993 1.502344 0.000217
C  -1.260077 0.737936 0.000105
C  -0.304088 1.788181 0.000241
C  -1.770649 -1.707026 -0.000264
C  -2.663076 1.054432 0.000162
H  0.92991 -1.946349 -0.000212
H  1.826438 2.293837 0.000322
H  -0.652749 2.824361 0.000374
