program: Gaussian 09
title: 000097456
version: EM64L-G09RevD.01
frameworkgroup: C1[X(C16H24O2)]
method: RPBEPBE
basis: SDD
operation: Freq
keyword: #pfreq=noraman
keyword: PBEPBE/SDD
title: #p freq=noraman PBEPBE/SDD
converged: YES YES NO NO
title: Mulliken charges:
elementType: O O C C C C C C C C C C C C C C C C H H H H H H H H H H H H H H H H H H H H H H H H
charge: -0.199120 -0.199102 0.178720 0.178703 0.402219 0.402361 -0.382462 -0.382627 -0.730203 -0.770808 -0.730055 -0.770817 0.008914 0.008850 -0.532653 -0.532790 -0.716402 -0.716434 0.252069 0.192757 0.252292 0.192713 0.209916 0.263243 0.213212 0.225628 0.223551 0.218881 0.209962 0.263032 0.213250 0.225631 0.223625 0.218819 0.285461 0.285492 0.219376 0.216765 0.220963 0.219361 0.216747 0.220962
chargesum: 0.00000
title: Mulliken charges with hydrogens summed into heavy atoms:
elementType: O O C C C C C C C C C C C C C C C C
charge: -0.199120 -0.199102 0.178720 0.178703 0.402219 0.402361 0.062364 0.062378 -0.043833 -0.102749 -0.043811 -0.102742 0.008914 0.008850 -0.247193 -0.247298 -0.059298 -0.059364
polarizability: 2.30336390e+02 -2.22747705e+01 1.74505222e+02 -9.70478208e-02 1.42020292e-01 1.41149079e+02
1716.lowfreq: -9.4716 -7.9073 0.0006 0.0007 0.0008 20.8143 34.3866 42.9283 70.7341
frequency: 34.3632 42.9196 70.4988 72.4271 76.4699 132.7773 148.5014 149.0023 172.3601 188.3934 214.0447 220.2211 227.9448 232.5810 234.5335 253.3043 254.1964 287.7067 314.2341 316.6566 334.0076 335.5350 341.3263 381.8954 392.9437 412.5303 414.5856 448.6107 450.3892 486.6539 499.7165 545.2982 600.3482 612.2970 666.4646 737.5172 767.2362 767.8231 788.0948 792.2244 796.3367 826.7797 892.5001 897.7032 926.2098 934.3093 935.9951 937.1913 988.3509 991.9113 994.5638 1012.0185 1012.7128 1039.9614 1052.9680 1065.3508 1066.9586 1071.7852 1153.4121 1161.8149 1182.2426 1201.3137 1214.0395 1224.7195 1235.4045 1236.6846 1291.3589 1302.0306 1328.0234 1328.4439 1339.4324 1346.2304 1372.2114 1372.9057 1392.1223 1392.7149 1396.0329 1396.7783 1461.1632 1461.2105 1469.7511 1469.9549 1470.8918 1471.9245 1478.5830 1479.5798 1483.9829 1484.3077 1487.4731 1487.7756 1497.8864 1499.4778 1517.1099 1542.0202 1588.5275 1635.5862 2977.3355 2977.3542 2979.0567 2979.1251 2980.5261 2980.5648 2983.6242 2983.9782 3054.8449 3054.8784 3067.5143 3067.6543 3071.6014 3071.6663 3072.8058 3073.0317 3079.3553 3079.6102 3082.4864 3082.6429 3107.0914 3107.7123 3156.8719 3159.5983
redmass: 3.9857 3.1822 2.4185 5.0217 2.3194 2.0321 3.3433 3.5540 2.0130 1.9979 1.2497 1.0851 1.7105 3.1320 1.7660 2.5150 2.5161 2.6361 1.1020 1.0949 4.7358 2.6231 2.4777 2.7422 3.0520 2.7981 2.8877 5.5106 3.7226 2.9698 3.5347 4.2490 3.7917 4.8316 5.3698 4.5624 1.8458 2.4024 2.3095 1.3691 2.1181 2.2845 2.0833 2.2382 1.6947 1.5815 1.5708 1.4413 2.0715 1.3132 1.5227 1.5043 1.5153 2.1567 1.6982 2.1091 2.0581 2.0184 2.7582 2.7649 2.6887 2.9040 2.2058 1.9269 1.5268 3.5935 1.5090 1.4306 1.3646 1.3616 2.7879 2.1879 1.2222 1.2142 1.2221 1.2195 1.2022 1.2021 1.0604 1.0601 1.0770 1.1056 1.0505 1.0547 1.0563 1.0479 1.0572 1.0550 1.0546 1.0507 1.0871 1.0601 6.9084 6.5318 8.1032 7.4463 1.0356 1.0356 1.0366 1.0368 1.0413 1.0420 1.0594 1.0585 1.0962 1.0962 1.0999 1.0999 1.0991 1.0991 1.0991 1.0991 1.0992 1.0991 1.0991 1.0990 1.0991 1.0990 1.0910 1.0916
irintensity: 1.7182 0.1269 0.0265 0.0156 1.3847 0.0630 5.1678 2.3525 0.3189 0.3741 0.6657 0.0464 0.0002 0.0620 0.1380 0.0186 0.1770 0.0246 0.0037 0.0986 10.3365 0.3653 0.0945 0.5347 0.1704 0.5321 1.8295 0.0421 14.8774 0.0193 0.0133 1.1829 10.7353 0.0367 0.0001 3.2012 13.3629 1.0549 8.4626 0.0658 12.1659 15.7344 1.8575 0.0007 0.7113 3.7489 2.3036 35.0530 0.3037 11.5434 1.3481 9.6646 15.3366 62.6536 1.2111 1.4731 0.3692 49.1066 33.1885 6.4295 34.2016 0.3415 0.1545 3.0245 0.2528 51.6468 0.3891 5.5799 0.3755 0.5756 0.3692 58.4424 6.9160 44.1798 13.1143 35.7636 11.6685 7.3464 0.1229 0.1046 37.3114 1.9427 0.3743 37.2050 0.2696 2.8556 19.3295 6.9629 19.3084 19.6708 54.0231 1.9947 0.1412 195.5288 154.7854 0.0070 4.0431 11.5038 18.0426 83.7747 22.5524 1.0747 102.2318 5.6774 0.0582 6.8217 5.7134 3.3539 52.7518 14.3711 42.2302 80.5404 119.9956 5.1489 10.5931 52.7038 11.5636 11.5021 7.1494 0.0004
temp: 298.150 k
press: 1.00000 atm
elementType: 8 8 6 6 6 6 6 6 6 6 6 6 6 6 6 6 6 6 1 1 1 1 1 1 1 1 1 1 1 1 1 1 1 1 1 1 1 1 1 1 1 1
symmnumber: 1
zpe: 944740.6 jmol-1
zpe.correction: 0.359833 hartree
zpe.thermalcorrener: 0.380238 hartree
zpe.thermalcorrenthalpy: 0.381183 hartree
zpe.thermalcorrgfe: 0.312315 hartree
zpe.sumelectzpe: -773.130673 hartree
zpe.sumelectthermal: -773.110267 hartree
zpe.sumelectthermalent: -773.109323 hartree
zpe.sumelectthermalfe: -773.178191 hartree
dipole: -0.0002 -0.0010 0.1582
dipole: 0.1582
quadrupole: -101.3505 -122.2746 -110.4098
quadrupole: 10.0166 0.0399 -0.0517
quadrupole: 9.9944 -10.9296 0.9352 10.0166 0.0399 -0.0517
hfenergy: -773.4905055 hartree
pointgroup: C01 [X(C16H24O2)]
dipole: -0.0000732 0.000078 -0.0622577 debye
polarizability: 231.0544629|21.3440264|173.7877016|-0.036405|-0.0405093|141.1485254 unknown
InChI: InChI=1S/C16H24O2/c1-7-15(3,4)11-9-14(18)12(10-13(11)17)16(5,6)8-2/h9-10H,7-8H2,1-6H3
charge 0 multiplicity 1
42 atoms
O  -1.47172 -2.28545 0.301972
O  1.472856 2.285184 0.297861
C  -3.027944 0.251086 0.290984
C  3.029038 -0.251316 0.290361
C  -1.494847 0.157211 0.279614
C  1.495948 -0.1575 0.279529
C  -3.635118 -0.502229 -0.9502
C  3.635686 0.503392 -0.950219
C  -3.567813 -0.429564 1.591154
C  -3.50993 1.724719 0.288075
C  3.569349 0.427927 1.591087
C  3.511114 -1.724922 0.285749
C  -0.81594 -1.19008 0.285485
C  0.817044 1.189781 0.285227
C  -0.6656 1.250952 0.274778
C  0.666713 -1.251253 0.275512
C  -3.168485 0.002962 -2.332457
C  3.16913 -0.000816 -2.332863
H  -3.400924 -1.5764 -0.850662
H  -4.736943 -0.401469 -0.87499
H  3.400954 1.577369 -0.849704
H  4.73757 0.403156 -0.875233
H  -4.669719 -0.337861 1.619339
H  -3.305029 -1.499087 1.618197
H  -3.161414 0.061793 2.494606
H  -4.61466 1.742119 0.276075
H  -3.156293 2.286061 -0.595103
H  -3.177032 2.263619 1.194579
H  4.671226 0.33578 1.619002
H  3.306929 1.4975 1.619203
H  3.162942 -0.064142 2.494153
H  4.615845 -1.742244 0.273856
H  3.157648 -2.285259 -0.598135
H  3.178114 -2.264912 1.191569
H  -1.058699 2.272214 0.26929
H  1.059815 -2.272517 0.270849
H  -2.07281 -0.08811 -2.451485
H  -3.439741 1.060357 -2.50502
H  -3.639317 -0.594097 -3.134727
H  2.073406 0.089898 -2.451709
H  3.440804 -1.057955 -2.506324
H  3.63965 0.597104 -3.134678
