program: Gaussian 09
title: 000097444
version: EM64L-G09RevD.01
frameworkgroup: C1[X(C9H9NO3)]
method: RPBEPBE
basis: SDD
operation: Freq
keyword: #pfreq=noraman
keyword: PBEPBE/SDD
title: #p freq=noraman PBEPBE/SDD
converged: YES YES NO NO
title: Mulliken charges:
elementType: O O O N C C C C C C C C C H H H H H H H H H
charge: -0.278612 -0.275845 -0.223654 -0.634964 0.303934 0.367733 -0.327521 -0.341069 -0.332805 -0.392635 0.150130 0.261400 -0.747429 0.210948 0.282717 0.304055 0.259827 0.254570 0.248177 0.254878 0.318280 0.337886
chargesum: 0.00000
title: Mulliken charges with hydrogens summed into heavy atoms:
elementType: O O O N C C C C C C C C C
charge: -0.278612 -0.275845 -0.223654 0.021201 0.303934 0.367733 -0.116573 -0.058352 -0.028750 -0.132808 0.150130 0.261400 0.010196
polarizability: 1.83827491e+02 -3.37363280e-01 1.17021307e+02 1.94783955e-01 -5.07780196e-02 5.17850700e+01
1716.lowfreq: -7.0605 -2.3207 -0.0007 -0.0004 0.0003 8.3014 30.6713 42.3300 51.8758
frequency: 30.6562 42.2790 51.8751 70.9838 123.0046 136.3321 213.0662 265.3423 300.0471 333.7054 401.8111 411.5472 462.4557 479.4708 507.1114 539.5134 554.4534 584.1694 612.8287 636.0835 691.3633 698.0699 758.4961 776.5631 840.2960 869.0306 884.9308 971.8011 993.3511 996.2610 1007.4552 1040.3291 1046.2679 1115.5256 1126.1528 1151.9734 1176.5405 1206.3426 1300.9472 1351.3806 1377.2844 1384.9368 1412.8963 1451.5853 1453.0452 1491.1621 1563.9217 1593.6316 1614.5070 1634.7085 1662.2169 3009.0842 3096.8829 3131.0070 3145.8840 3157.4561 3176.5900 3212.6803 3531.6820 3684.7123
redmass: 6.3118 4.1428 2.8401 1.2454 5.2499 5.7577 6.3464 4.8288 5.6369 5.0707 3.4976 3.1951 2.2768 1.8782 2.1020 4.8544 3.1071 1.2738 5.4482 4.9851 3.8861 5.2446 3.9428 5.8940 1.3283 1.6418 7.0454 1.3452 1.9750 1.3713 2.9048 1.6426 1.9373 1.6321 1.9714 2.4375 3.2132 1.5323 1.2726 3.8734 5.7323 1.2831 3.7917 1.0600 1.0465 2.5246 4.7006 2.5875 6.1836 2.0933 9.6539 1.0368 1.0973 1.0903 1.1011 1.0885 1.0972 1.0942 1.0448 1.1039
irintensity: 15.2375 3.6020 0.9939 0.0369 7.9524 1.4465 3.9253 0.7275 3.7494 5.6088 7.1086 2.3657 24.1005 41.3331 123.8650 2.6762 0.5391 68.7396 15.9265 19.7078 45.1279 17.9247 33.3425 2.5834 10.3967 62.1829 68.3923 2.1090 103.4161 6.0621 33.8404 9.6626 2.8318 13.5191 14.4379 399.1061 327.4443 63.7241 0.5973 289.9505 25.4289 45.1570 37.8834 25.1560 19.2560 49.7578 119.1150 23.1994 80.3747 236.0643 195.5428 0.8595 5.8997 18.2969 10.0492 0.2893 3.9501 3.2739 41.5257 29.7966
temp: 298.150 k
press: 1.00000 atm
elementType: 8 8 8 7 6 6 6 6 6 6 6 6 6 1 1 1 1 1 1 1 1 1
symmnumber: 1
zpe: 433919.6 jmol-1
zpe.correction: 0.165271 hartree
zpe.thermalcorrener: 0.177765 hartree
zpe.thermalcorrenthalpy: 0.178710 hartree
zpe.thermalcorrgfe: 0.124606 hartree
zpe.sumelectzpe: -627.863632 hartree
zpe.sumelectthermal: -627.851138 hartree
zpe.sumelectthermalent: -627.850193 hartree
zpe.sumelectthermalfe: -627.904297 hartree
dipole: 2.1772 1.6220 0.9073
dipole: 2.8626
quadrupole: -70.4048 -71.5363 -77.5563
quadrupole: -22.7965 -3.1206 0.2102
quadrupole: 2.7610 1.6295 -4.3905 -22.7965 -3.1206 0.2102
hfenergy: -628.028903 hartree
pointgroup: C01 [X(C9H9N1O3)]
dipole: 0.8199281 0.5378946 0.553849 debye
dipolederiv: -2.325986 -0.3751766 -0.1350901 -0.6516515 -0.5718246 -0.1125165 -0.2066483 -0.1098469 -0.2167408 -0.9606802 -0.2413699 -0.1327343 -0.1403749 -0.7489231 -0.2206432 -0.0514774 -0.2075497 -0.4960308 -0.664079 0.111697 0.023184 -0.5276473 -0.909515 -0.1717968 -0.147678 -0.161353 -0.3390587 -0.7342446 0.3759444 0.2336117 0.4230843 -0.8742156 -0.0646365 0.2530955 -0.0438747 -0.705341 -0.6189769 0.0304366 -0.0017535 0.0055348 -0.0693018 -0.0375376 -0.0273052 -0.0330473 -0.0098727 1.4784458 0.1206625 0.0553502 -0.1894248 0.1541356 0.0066264 -0.024094 0.0139705 0.1010088 0.1325545 -0.0482076 -0.0035876 0.0230287 0.0755584 0.0427731 0.0663216 0.0396049 -0.1442572 0.1215465 0.0625338 0.0194528 -0.0608421 0.0408004 0.0325135 -0.0343273 0.0551782 -0.0981465 -0.4170411 0.0432137 0.0060336 0.2260633 -0.1064714 0.0106459 0.0563951 0.0078191 -0.141708 -0.3492321 -0.1241158 -0.0345084 -0.1845044 0.0074843 0.0418633 -0.0509666 0.0429489 -0.1596361 1.769137 -0.1288883 -0.0554708 -0.2449806 1.131287 0.5092875 -0.141757 0.467946 0.5091623 2.1024282 0.1268377 0.0690186 1.1443281 1.3108139 0.3104855 0.3414659 0.2927107 0.298027 -0.403016 0.1380521 0.0262925 0.254857 -0.1037259 -0.0261713 0.0487743 -0.0260248 0.0097649 0.0181468 0.0955174 0.0219145 0.1085872 -0.0527012 -0.042369 0.0135367 -0.0473174 0.1341299 0.1014856 -0.0752705 -0.0178549 -0.0405358 0.0452709 -0.0246823 0.0011064 -0.0361384 0.1473079 0.140598 -0.0435419 -0.0111191 -0.0330459 0.0685471 -0.026307 -0.011719 -0.0271387 0.1769177 0.0564754 0.0720236 0.0166258 0.0772922 0.0075017 -0.0389038 0.0179659 -0.0385733 0.1617306 0.0817972 -0.0082217 0.0202522 0.0002922 0.0280592 0.0992881 -0.0175783 0.1003488 0.0454706 -0.0298084 -0.0548628 -0.0144566 -0.1041654 0.0165073 -0.0284846 -0.0248866 -0.029184 0.1237049 0.0834539 0.0028658 -0.0202967 -0.0083419 0.1127431 -0.0660009 0.0191883 -0.0673013 -0.0383328 0.2229954 -0.0604458 -0.0483838 -0.0687182 0.2084832 -0.1034436 -0.0623148 -0.1068618 0.3103756 0.194 -0.0196838 -0.0164802 -0.0088353 0.2294867 -0.0899902 -0.0170972 -0.0863157 0.3315245 unknown
polarizability: 183.676578|2.3393166|111.21995|2.4611611|18.773817|57.73734 unknown
InChI: InChI=1S/C9H9NO3/c1-6(11)13-8-4-2-7(3-5-8)9(10)12/h2-5H,10H2,1H3
charge 0 multiplicity 1
22 atoms
O  2.408189 -0.405586 -0.187134
O  -3.988543 -0.944998 -0.690398
O  3.194122 1.740965 0.397901
N  -3.966899 1.100401 0.391513
C  -1.818565 0.004074 -0.148437
C  1.00302 -0.162536 -0.147689
C  -1.0244 1.142494 0.138016
C  -1.169891 -1.22161 -0.450696
C  0.386164 1.077832 0.142721
C  0.231493 -1.309884 -0.447469
C  -3.325849 0.009408 -0.176711
C  3.413405 0.554068 0.086571
C  4.765039 -0.105948 -0.061192
H  -1.485585 2.117791 0.333669
H  -1.793298 -2.088573 -0.690318
H  0.98773 1.96055 0.358471
H  0.745566 -2.248384 -0.674136
H  4.858857 -0.941656 0.653955
H  5.55769 0.632763 0.123747
H  4.873637 -0.529152 -1.07454
H  -3.47664 1.836702 0.89338
H  -4.985642 1.113978 0.364877
