program: Gaussian 09
title: 000097419
version: EM64L-G09RevD.01
frameworkgroup: C1[X(C10H10N2O)]
method: RPBEPBE
basis: SDD
operation: Freq
keyword: #p
keyword: freq=noraman
keyword: PBEPBE/SDD
title: #p freq=noraman PBEPBE/SDD
converged: NO YES NO NO
title: Mulliken charges:
elementType: O N N C C C C C C C C C C H H H H H H H H H H
charge: -0.247308 0.032789 -0.006656 0.438813 -0.423610 -0.372797 -0.372782 -0.222461 -0.222459 -0.228127 0.146884 -0.715176 -0.184482 0.224991 0.224991 0.235801 0.235806 0.231042 0.231041 0.233018 0.258549 0.258614 0.243521
chargesum: 0.00000
title: Mulliken charges with hydrogens summed into heavy atoms:
elementType: O N N C C C C C C C C C C
charge: -0.247308 0.032789 -0.006656 0.438813 0.026371 -0.136996 -0.136977 0.008581 0.008582 0.004890 0.146884 0.045508 -0.184482
polarizability: 2.02820996e+02 1.44300689e+01 8.29718428e+01 -4.78124413e-02 4.08186056e-02 1.00773705e+02
1716.lowfreq: -7.6301 0.0006 0.0008 0.0009 5.0836 9.0797 12.7680 15.2762 25.0478
frequency: 8.8394 12.5610 24.3179 54.6125 107.9997 125.0041 196.8815 205.9297 277.6163 311.6838 321.1372 403.3141 425.3764 457.5486 531.9659 557.6755 559.7949 610.3736 617.4557 702.0838 755.7505 791.1172 829.6108 854.6593 902.9870 911.3590 945.9150 958.6517 979.0504 990.9836 999.8281 1013.3533 1026.7659 1030.4847 1089.5565 1174.0868 1180.6472 1187.3644 1227.2017 1251.5937 1324.8445 1343.8699 1386.8247 1390.5830 1440.7787 1451.7921 1457.0631 1478.0285 1487.0980 1528.0173 1596.4375 1616.9295 2173.9006 2996.0275 3013.0845 3075.8713 3081.1006 3123.9849 3125.8650 3129.2628 3137.7984 3151.1301 3166.6891
redmass: 2.1432 1.4133 3.8867 5.4307 4.6042 7.5755 3.9578 8.3012 5.5251 4.6216 2.2887 2.7991 7.1209 4.2191 5.5426 6.0652 4.7004 5.6467 6.3439 1.7728 2.1606 3.4220 4.2789 1.2468 3.7367 3.5263 2.4392 1.5960 1.3938 6.1771 1.3269 1.8277 2.1740 1.5053 1.5051 1.0561 1.0846 1.1120 2.4908 5.2780 1.2784 1.3568 8.9011 1.1934 2.1928 1.0454 1.1267 1.1043 2.4207 6.8422 6.1385 6.2046 12.6077 1.0367 1.0572 1.0969 1.1091 1.0855 1.0885 1.1008 1.0920 1.0963 1.1017
irintensity: 0.3378 0.2856 2.7996 0.6831 2.5607 3.8033 0.3612 4.1710 3.1276 3.9552 0.4685 0.0002 0.1646 2.2226 10.3259 5.8773 0.1507 24.8728 0.1081 56.2367 77.4686 5.1550 23.6088 0.0000 85.7995 259.6299 4.2425 1.8890 0.0166 1.0831 0.0381 39.0076 3.9983 4.1708 7.3290 0.0131 1.1150 0.7556 18.9613 19.7578 0.2698 63.5229 0.6862 26.0817 9.3503 19.9819 11.8227 8.9918 2.6978 13.7006 0.6617 0.6759 23.9833 4.7465 37.3687 7.0918 16.1145 4.5233 2.4469 11.0316 13.5498 37.1248 20.2224
temp: 298.150 k
press: 1.00000 atm
elementType: 8 7 7 6 6 6 6 6 6 6 6 6 6 1 1 1 1 1 1 1 1 1 1
symmnumber: 1
zpe: 462297.6 jmol-1
zpe.correction: 0.176080 hartree
zpe.thermalcorrener: 0.188977 hartree
zpe.thermalcorrenthalpy: 0.189922 hartree
zpe.thermalcorrgfe: 0.131834 hartree
zpe.sumelectzpe: -570.779653 hartree
zpe.sumelectthermal: -570.766755 hartree
zpe.sumelectthermalent: -570.765811 hartree
zpe.sumelectthermalfe: -570.823898 hartree
dipole: 5.1314 1.7287 -0.0051
dipole: 5.4148
quadrupole: -96.5528 -74.9918 -68.9352
quadrupole: -6.6141 0.0210 0.0150
quadrupole: -16.3929 5.1682 11.2247 -6.6141 0.0210 0.0150
hfenergy: -570.9557328 hartree
pointgroup: C01 [X(C10H10N2O1)]
dipole: 2.0268752 -0.6558509 0.0001347 debye
dipolederiv: -1.8742506 -0.2938845 -0.0002413 0.3353631 -0.1948889 -0.0000338 0.0002053 0.000067 -0.2117995 1.0393279 0.2326559 0.000311 -0.451985 -0.3215775 -0.0000173 0.0001793 -0.0001796 -0.1013863 -0.4509806 -0.0135484 0.000579 0.0519966 -0.1925772 -0.0001397 0.0001065 0.0000225 -0.2295346 -0.0790591 -0.0260081 -0.0000081 0.0329193 -0.1159565 -0.0000578 0.0000711 -0.0000703 -0.014716 1.3247785 0.1318984 0.0000718 0.5576881 0.480173 0.0001393 0.000152 0.0000949 0.3086651 -0.0407758 -0.0476059 -0.0932914 -0.049189 -0.124894 0.0305223 0.0288308 0.023372 0.0457978 -0.0407429 -0.0477121 0.0932639 -0.0491436 -0.1248389 -0.0306692 -0.0288515 -0.0235121 0.0457114 -0.0858694 -0.0372823 0.1058058 -0.0329457 -0.1258704 -0.046398 0.1200207 -0.0343643 0.0710455 -0.0859283 -0.0371542 -0.1058019 -0.0328471 -0.1259471 0.0462407 -0.1200054 0.0341975 0.0711618 0.059491 -0.1092923 -0.0000561 -0.0944061 -0.1029797 -0.0000131 -0.0000465 -0.0000143 -0.0353958 -0.2559939 -0.1918796 -0.0003231 -0.1861648 0.4897007 0.00002 -0.0007181 -0.0001351 0.100997 0.0064207 0.1648508 0.0003244 0.0348937 -0.1774304 0.0000132 0.0011052 0.0006312 0.0596878 0.3703797 0.0139222 -0.0005004 -0.1111943 -0.1409221 0.000005 -0.0004211 -0.0000851 0.0209912 -0.0440169 0.009269 0.019697 -0.1206359 -0.0153566 -0.0471955 0.0100822 -0.1284292 -0.0599355 -0.0440215 0.0093302 -0.0196974 -0.1205927 -0.015533 0.0472329 -0.0102112 0.1284788 -0.0597305 0.0676086 0.0520168 0.0936625 0.0478351 0.1228537 -0.0408502 0.087296 -0.030484 -0.0420842 0.0675723 0.0521093 -0.0936428 0.0479331 0.1227944 0.0409782 -0.087291 0.0306171 -0.0419844 0.0387526 0.0451068 -0.079219 0.0573452 0.1382614 0.0334145 -0.0974921 0.0352063 -0.0661368 0.0387988 0.0450273 0.0792224 0.0572523 0.1383136 -0.0332537 0.0975102 -0.0350415 -0.0662319 -0.0878227 0.1019337 0.0000636 0.1098647 0.1142324 -0.0000026 0.0000688 -0.0000009 0.0886908 0.0682159 0.0292871 -0.0951631 -0.001562 0.0602741 -0.0021129 -0.0685251 0.0427564 -0.0064207 0.0670715 0.0292963 0.0956497 -0.0012521 0.0605978 0.0024192 0.0686118 -0.0426028 -0.005409 -0.0589556 -0.1123364 -0.0007063 -0.0811729 0.0515713 -0.0002415 -0.0006779 -0.0005243 0.1280165 unknown
polarizability: 203.1500564|-12.9878084|82.6426936|0.010411|-0.0098406|100.7737939 unknown
InChI: InChI=1S/C10H10N2O/c1-9(7-11)12-13-8-10-5-3-2-4-6-10/h2-6H,8H2,1H3
charge 0 multiplicity 1
23 atoms
O  -0.718813 0.032926 0.000326
N  -2.050113 0.596028 0.000588
N  -5.480497 0.359272 -0.000615
C  1.646276 0.573524 0.000484
C  0.263468 1.175733 0.000918
C  2.302529 0.280253 1.222774
C  2.302223 0.281301 -1.222223
C  3.592174 -0.295842 1.224242
C  3.591866 -0.294797 -1.224508
C  4.239146 -0.584188 -0.000338
C  -2.950186 -0.380128 -0.00003
C  -2.642805 -1.862788 -0.001108
C  -4.322906 0.055602 0.000677
H  0.066285 1.782742 0.901967
H  0.066168 1.783772 -0.899411
H  1.80125 0.503739 2.172277
H  1.800711 0.505615 -2.171407
H  4.092246 -0.516539 2.173624
H  4.091699 -0.51468 -2.174205
H  5.241065 -1.027822 -0.000653
H  -2.038223 -2.125097 0.886164
H  -2.032568 -2.122563 -0.88521
H  -3.566695 -2.459764 -0.004732
