program: Gaussian 09
title: 000010892
version: EM64L-G09RevD.01
frameworkgroup: C1[X(C6H4F2)]
method: RPBEPBE
basis: SDD
operation: Freq
keyword: #p
keyword: freq=noraman
keyword: PBEPBE/SDD
title: #p freq=noraman PBEPBE/SDD
converged: NO NO NO NO
title: Mulliken charges:
elementType: F F C C C C C C H H H H
charge: -0.200948 -0.200960 0.315578 0.315596 -0.319014 -0.319011 -0.319012 -0.319016 0.261697 0.261696 0.261696 0.261701
chargesum: 0.00000
title: Mulliken charges with hydrogens summed into heavy atoms:
elementType: F F C C C C C C
charge: -0.200948 -0.200960 0.315578 0.315596 -0.057317 -0.057315 -0.057317 -0.057316
polarizability: 7.85772273e+01 2.00699783e-04 7.04563382e+01 -6.35419417e-04 3.71786296e-05 2.58752977e+01
1716.lowfreq: -12.3173 -5.9436 0.0011 0.0012 0.0014 39.5918 146.4267 315.8892 352.0516
frequency: 146.4267 315.8892 352.0447 413.4453 418.3489 434.1799 502.8834 622.8261 696.7295 701.3980 799.9637 822.1370 833.8933 928.7286 940.3955 996.9570 1096.0110 1149.1685 1168.5466 1218.1869 1278.0739 1371.3051 1406.0229 1484.9366 1604.4166 1608.8060 3157.6460 3158.4637 3175.3494 3178.5889
redmass: 11.7911 11.7762 7.8526 4.9441 3.0910 13.8106 2.5731 7.2436 3.9405 6.7174 1.2422 6.8056 1.5801 1.3237 1.3297 2.7155 1.2582 1.1521 2.6594 7.3047 1.2614 9.0616 3.5596 2.7011 8.1905 6.5567 1.0887 1.0893 1.0978 1.0984
irintensity: 2.3623 5.7237 0.0000 0.0000 0.0000 0.0000 24.6473 0.0000 0.0000 51.7349 0.0000 0.0000 115.3097 0.0000 0.0000 7.7469 15.3788 0.0000 122.9268 0.0000 0.0000 0.3343 0.0573 206.6372 0.0000 0.0000 4.9037 0.0008 1.4464 0.0000
temp: 298.150 k
press: 1.00000 atm
elementType: 9 9 6 6 6 6 6 6 1 1 1 1
symmnumber: 1
zpe: 215218.8 jmol-1
zpe.correction: 0.081973 hartree
zpe.thermalcorrener: 0.088148 hartree
zpe.thermalcorrenthalpy: 0.089092 hartree
zpe.thermalcorrgfe: 0.051587 hartree
zpe.sumelectzpe: -430.148972 hartree
zpe.sumelectthermal: -430.142797 hartree
zpe.sumelectthermalent: -430.141852 hartree
zpe.sumelectthermalfe: -430.179357 hartree
dipole: -0.0001 0.0000 0.0000
dipole: 0.0001
quadrupole: -54.3886 -35.7525 -46.9609
quadrupole: 0.0001 0.0002 0.0002
quadrupole: -8.6879 9.9481 -1.2602 0.0001 0.0002 0.0002
hfenergy: -430.2309445 hartree
pointgroup: C01 [X(C6H4F2)]
dipole: 0.0000335 0.0000099 0.0000089 debye
dipolederiv: -1.0839505 -0.0000183 0.0000213 -0.0000179 -0.2047109 -0.0000001 0.0001207 -0.0000049 -0.1454218 -1.0839307 -0.0000202 -0.0000678 -0.0000198 -0.2047189 0.0000011 -0.0001352 0.0000017 -0.1454327 1.1941541 0.0000188 -0.0000575 0.000024 0.1493013 -0.000001 -0.0001642 0.0000076 0.0822927 1.1941275 0.0000202 0.0001086 0.0000207 0.1493052 -0.000002 0.0001928 0.0000047 0.0822944 -0.1134925 0.0590848 0.000012 -0.1607397 0.0185259 0.0000123 0.0000259 -0.0000101 -0.1527631 -0.1135003 -0.0590817 -0.0000199 0.1607331 0.0185284 0.0000237 -0.0000323 -0.000007 -0.1527587 -0.1135022 -0.0590855 0.0000095 0.1607337 0.0185353 -0.0000128 0.0000233 -0.0000079 -0.1527635 -0.1135068 0.0590817 -0.0000022 -0.1607381 0.0185136 -0.0000296 -0.0000173 -0.0000039 -0.1527611 0.0583956 0.0589506 0.0000016 0.0641053 0.0091809 -0.0000059 0.0000057 0.0000033 0.1843287 0.0584023 -0.0589511 0.0000008 -0.0640999 0.0091836 -0.0000066 -0.0000097 -0.0000054 0.1843274 0.0584031 -0.0589469 0.0000003 -0.0641064 0.0091705 0.0000094 0.0000104 0.0000105 0.1843282 0.0584004 0.0589477 -0.0000067 0.064105 0.0091851 0.0000116 -0.0000199 0.0000115 0.1843295 unknown
polarizability: 78.5772272|0.0003919|70.4563382|0.0006354|-0.0000372|25.8752977 unknown
InChI: InChI=1S/C6H4F2/c7-5-1-2-6(8)4-3-5/h1-4H
charge 0 multiplicity 1
12 atoms
F  2.78639 0.000069 -0.000065
F  -2.786298 -0.000056 -0.000162
C  1.38169 0.000045 0.000077
C  -1.381582 -0.000019 0.000028
C  0.706311 -1.236526 0.000012
C  -0.706174 -1.236557 0.000045
C  0.706255 1.23657 0.000046
C  -0.706225 1.236532 0.000018
H  1.27315 -2.1730 -0.000036
H  -1.272998 -2.173052 0.000017
H  1.273038 2.173085 -0.000017
H  -1.273057 2.173009 -0.000064
