program: Gaussian 09
title: 000097450
version: EM64L-G09RevD.01
frameworkgroup: C1[X(C18H13ClFNO4S)]
method: RPBEPBE
basis: SDD
operation: Freq
keyword: #p
keyword: freq=noraman
keyword: PBEPBE/SDD
title: #p freq=noraman PBEPBE/SDD
converged: YES YES NO NO
title: Mulliken charges:
elementType: Cl S F O O O O N C C C C C C C C C C C C C C C C C C H H H H H H H H H H H H H
charge: -0.011667 1.087524 -0.344088 -0.285410 -0.244728 -0.477282 -0.475614 -0.049685 0.487346 -0.117492 0.051058 0.382893 -0.238724 -0.473978 -0.247387 0.225855 -0.304158 -0.350441 -0.339587 -0.329574 -0.119817 -0.233186 -0.225943 0.169511 -0.222544 -0.672136 0.297453 0.248650 0.270928 0.235507 0.301738 0.281744 0.288106 0.288123 0.234260 0.233566 0.217195 0.230954 0.231032
chargesum: 0.00000
title: Mulliken charges with hydrogens summed into heavy atoms:
elementType: Cl S F O O O O N C C C C C C C C C C C C C C C C C C
charge: -0.011667 1.087524 -0.344088 -0.285410 -0.244728 -0.477282 -0.475614 -0.049685 0.487346 -0.117492 0.051058 0.382893 -0.238724 -0.176526 0.001263 0.225855 -0.033230 -0.114934 -0.037849 -0.047830 -0.119817 0.054921 0.062180 0.169511 0.245282 0.007044
polarizability: 5.36006676e+02 -8.26811028e+00 2.64686335e+02 5.91630354e+00 1.85691142e-01 1.15972268e+02
1716.lowfreq: -3.4669 -1.4745 -0.0014 -0.0009 0.0013 2.4554 8.8118 20.5011 23.3863
frequency: 8.5907 20.2556 23.2784 34.0887 44.2396 52.8495 61.5380 83.9411 99.3093 121.5579 138.0270 140.9752 149.4139 152.9930 178.5784 199.5906 225.1042 246.2334 251.1283 259.2714 274.9004 295.8881 321.5340 342.2063 358.3320 372.6091 388.7576 402.2592 404.9621 421.4506 458.6320 479.5556 492.5900 528.4852 536.6109 553.9657 557.4543 599.9290 617.5197 628.8915 665.6213 670.7043 727.9180 732.0513 738.6744 791.0483 791.8207 798.0815 814.4342 831.6614 837.7837 853.9114 858.9775 866.1929 881.2295 901.0604 951.1544 962.5750 972.6420 986.2208 993.8454 1003.9631 1011.8151 1022.1597 1047.3345 1053.4797 1079.2692 1112.8172 1116.5670 1135.4565 1139.8054 1171.9374 1189.6482 1217.0623 1248.8911 1264.3543 1282.8077 1295.8092 1302.9239 1336.4398 1356.3439 1363.5911 1382.8061 1398.2464 1401.0367 1409.6747 1450.3592 1464.2040 1472.5590 1476.1934 1485.8541 1486.1185 1537.5626 1572.1671 1587.2118 1590.9638 1614.0222 1630.4217 2996.9719 3012.7110 3071.8708 3093.7447 3108.8519 3157.7080 3161.5608 3161.9054 3163.4199 3174.4180 3181.1858 3187.3728 3192.3482
redmass: 8.2557 4.8371 4.8743 4.6669 6.5595 5.0493 4.7957 6.1680 5.9552 3.9977 8.8232 10.1611 8.6043 5.6855 5.2278 4.2953 12.1455 2.0624 2.8616 6.5760 7.3349 8.3777 9.8136 5.9341 6.1995 6.9677 5.6171 9.9595 2.8685 3.5003 11.3055 5.9521 3.9272 6.9588 3.8081 5.6291 10.1872 6.5360 7.1302 8.5716 6.6461 4.8493 4.2357 6.2183 3.2550 4.9109 3.2866 1.1337 8.2564 4.3669 1.3817 15.8942 1.4136 1.6198 1.7364 6.1488 1.5179 4.2586 1.3869 5.6922 16.6332 1.3457 1.3619 2.3232 3.4109 2.4462 3.2537 2.2441 1.3581 1.4667 1.4920 1.9721 1.2484 2.0756 1.1338 1.7202 2.4014 2.4027 1.8450 4.6601 1.5362 2.6530 5.6640 6.9457 1.2766 4.2600 3.0159 1.0401 1.0646 3.3344 1.0755 3.4772 7.7089 8.8678 6.7323 6.7543 10.4506 7.5124 1.0358 1.0582 1.1066 1.0985 1.1029 1.0884 1.0897 1.0918 1.0892 1.0967 1.0964 1.0969 1.0917
irintensity: 0.1081 0.0132 1.4368 0.0320 0.5110 2.0863 1.0974 3.0678 0.5918 1.3313 1.1849 1.2236 0.6167 0.8953 1.4427 8.4233 1.3880 9.9183 11.1031 3.6082 1.3793 2.2146 2.3823 44.6886 6.6920 1.8214 4.8323 2.9483 0.1059 3.3565 69.5705 1.9783 26.1268 0.1556 9.5661 19.8035 174.7603 2.2304 0.0017 12.5200 28.6464 16.7891 26.9118 16.9684 5.5759 10.3635 1.1554 2.5392 46.5938 1.5516 10.5250 139.1368 27.9285 73.0606 0.8348 33.8753 17.6265 23.4935 0.7606 0.8550 73.8794 0.0062 1.6895 80.1508 100.2024 11.3074 199.1891 7.7064 9.9614 6.0878 13.8132 269.4698 32.9289 303.2762 0.0432 130.5548 3.3662 3.6430 1.2983 3.3055 1.1014 17.1648 11.9762 0.5180 22.0751 57.2552 99.1528 12.9679 6.1207 20.6413 12.9142 62.9268 23.4392 54.7421 1.5457 46.9499 225.7472 50.0828 21.8913 19.1376 6.0216 31.3107 42.5848 3.2963 5.0753 0.7526 1.3223 7.5671 0.6885 2.3107 0.7871
temp: 298.150 k
press: 1.00000 atm
elementType: 17 16 9 8 8 8 8 7 6 6 6 6 6 6 6 6 6 6 6 6 6 6 6 6 6 6 1 1 1 1 1 1 1 1 1 1 1 1 1
symmnumber: 1
zpe: 708973.1 jmol-1
zpe.correction: 0.270034 hartree
zpe.thermalcorrener: 0.294393 hartree
zpe.thermalcorrenthalpy: 0.295338 hartree
zpe.thermalcorrgfe: 0.211259 hartree
zpe.sumelectzpe: -2005.347263 hartree
zpe.sumelectthermal: -2005.322903 hartree
zpe.sumelectthermalent: -2005.321959 hartree
zpe.sumelectthermalfe: -2005.406038 hartree
dipole: 8.2752 -0.6111 -0.6612
dipole: 8.3240
quadrupole: -206.8591 -158.3021 -170.2394
quadrupole: -31.3566 3.3001 -0.2731
quadrupole: -28.3922 20.1647 8.2275 -31.3566 3.3001 -0.2731
hfenergy: -2005.6172966 hartree
pointgroup: C01 [X(C18H13Cl1F1N1O4S1)]
dipole: 3.2612551 -0.16567 -0.2489053 debye
polarizability: 536.0807712|-4.5971356|263.3145987|8.9781009|13.1433383|117.2699091 unknown
InChI: InChI=1S/C18H13ClFNO4S/c1-2-25-18(22)12-5-8-16-14(9-12)15(19)10-17(21-16)11-3-6-13(7-4-11)26(20,23)24/h3-10H,2H2,1H3
charge 0 multiplicity 1
39 atoms
Cl 1.607782 3.765632 0.419961
S  -6.936189 -0.713056 -0.20189
F  -7.238996 -0.860897 1.626649
O  6.251693 -1.105893 0.015153
O  6.171601 1.211746 0.263966
O  -7.775857 0.569749 -0.683534
O  -7.177041 -2.181612 -0.807356
N  -0.10378 -0.524954 -0.050545
C  1.879601 0.975284 0.14157
C  1.262105 -0.335501 -0.002753
C  -0.921871 0.551409 0.039564
C  -2.389733 0.279893 -0.014541
C  0.967669 2.076432 0.233483
C  3.298465 1.082485 0.183004
C  -0.407157 1.888033 0.185608
C  4.09727 -0.064921 0.084267
C  2.108798 -1.487328 -0.100803
C  -3.35802 1.321762 0.009211
C  -2.830847 -1.071209 -0.09834
C  3.494776 -1.359549 -0.058951
C  -5.112145 -0.318241 -0.118468
C  -4.736212 1.031527 -0.039171
C  -4.200604 -1.387451 -0.147463
C  5.582008 0.110617 0.133536
C  7.746899 -1.036228 0.050584
C  8.258843 -2.459651 -0.138097
H  3.78035 2.059055 0.292234
H  -1.072799 2.748644 0.264748
H  1.623079 -2.461199 -0.209154
H  -3.057692 2.371605 0.063595
H  -2.071275 -1.856751 -0.121091
H  4.144465 -2.235141 -0.133549
H  -5.488325 1.826092 -0.02745
H  -4.547651 -2.422862 -0.216119
H  8.078161 -0.352487 -0.751544
H  8.046576 -0.599942 1.020487
H  9.363764 -2.462612 -0.117167
H  7.896079 -3.121146 0.66703
H  7.93011 -2.873133 -1.106762
