program: Gaussian 09
title: 000097398
version: EM64L-G09RevD.01
frameworkgroup: C1[X(C6H10O6)]
method: RPBEPBE
basis: SDD
operation: Freq
keyword: #pfreq=noraman
keyword: PBEPBE/SDD
title: #p freq=noraman PBEPBE/SDD
converged: YES YES NO NO
title: Mulliken charges:
elementType: O O O O O O C C C C C C H H H H H H H H H H
charge: -0.437366 -0.531010 -0.440412 -0.487136 -0.123550 -0.128152 -0.128349 -0.010749 -0.237003 -0.368178 0.131135 -0.131510 0.231589 0.233620 0.271969 0.246534 0.202492 0.366474 0.393955 0.397163 0.368808 0.179677
chargesum: 0.00000
title: Mulliken charges with hydrogens summed into heavy atoms:
elementType: O O O O O O C C C C C C
charge: -0.070892 -0.137055 -0.043248 -0.118328 -0.123550 -0.128152 0.103240 0.222871 0.034966 0.080848 0.131135 0.048167
polarizability: 9.80635456e+01 8.70579891e+00 7.93877298e+01 -4.31607127e-01 -1.24776439e+00 8.00048839e+01
1716.lowfreq: -10.1082 -0.0004 0.0006 0.0008 8.1811 18.1870 34.7366 60.5662 73.1197
frequency: 34.6135 60.5379 73.0541 89.1653 113.0998 133.4987 177.3214 225.4138 268.6387 276.9317 282.9962 301.0031 326.8361 336.4996 393.1152 481.4774 493.8428 509.9659 542.2699 608.7805 654.0694 723.5890 763.1150 790.6217 848.1371 889.5304 931.2840 936.2709 964.2627 997.9158 1024.3050 1046.8701 1074.4009 1088.2404 1175.7145 1180.3269 1218.2394 1221.7505 1247.7598 1301.2189 1315.6646 1345.0670 1365.2399 1373.2306 1381.8858 1400.6519 1439.1150 1472.1325 1604.3779 1649.4621 2864.4590 2959.5291 2979.7301 3016.5867 3035.0310 3055.9405 3326.1298 3449.0025 3501.8320 3608.4000
redmass: 10.8224 3.9436 7.2217 3.9961 3.2448 4.5851 5.3627 6.1380 4.9758 1.1730 5.0333 9.2001 4.4570 5.1237 7.0540 3.0493 1.3785 1.7757 1.4456 3.5490 1.1892 4.5215 3.6706 3.8883 3.2681 5.0503 2.2517 2.7973 5.9865 4.4708 2.5498 2.3429 2.5865 3.1428 1.1559 1.0923 1.1957 1.4114 1.1878 1.4470 1.2834 1.2621 1.4149 1.2204 1.2151 1.6063 1.1644 1.0791 11.9610 8.9401 1.0859 1.0836 1.0577 1.0834 1.0854 1.1062 1.0650 1.0645 1.0649 1.0671
irintensity: 2.0587 1.9509 2.7140 8.8287 6.6778 12.8195 18.3487 8.4986 1.1726 139.2106 4.9850 3.5812 4.4182 4.5049 2.4894 1.3369 93.7367 12.1574 123.9709 7.5388 325.1706 23.7615 38.3021 27.1129 2.2016 20.7623 20.1714 25.1485 79.4292 117.1743 57.6664 20.1058 12.8318 57.8878 24.7152 45.2411 67.0960 16.1680 48.7776 7.0919 7.7463 3.8007 47.9590 2.4570 42.6297 6.3593 105.3594 9.8374 135.8346 21.8967 93.7295 32.4013 34.5607 14.7369 30.3767 37.9072 171.3378 39.1549 61.4576 14.5646
temp: 298.150 k
press: 1.00000 atm
elementType: 8 8 8 8 8 8 6 6 6 6 6 6 1 1 1 1 1 1 1 1 1 1
symmnumber: 1
zpe: 430357.5 jmol-1
zpe.correction: 0.163915 hartree
zpe.thermalcorrener: 0.177341 hartree
zpe.thermalcorrenthalpy: 0.178285 hartree
zpe.thermalcorrgfe: 0.123246 hartree
zpe.sumelectzpe: -684.950955 hartree
zpe.sumelectthermal: -684.937529 hartree
zpe.sumelectthermalent: -684.936585 hartree
zpe.sumelectthermalfe: -684.991624 hartree
dipole: 4.6119 -0.3746 -3.0614
dipole: 5.5481
quadrupole: -63.9769 -79.2536 -73.4453
quadrupole: -11.6453 6.9930 2.6860
quadrupole: 8.2484 -7.0283 -1.2200 -11.6453 6.9930 2.6860
hfenergy: -685.11487 hartree
pointgroup: C01 [X(C6H10O6)]
dipole: -1.8664479 -0.3556904 1.0744619 debye
dipolederiv: -0.7925707 0.1104379 0.0782361 0.0814064 -0.6475374 -0.2361751 0.0325133 -0.2806682 -0.419211 -0.6683964 0.0284272 -0.0281244 0.0399805 -0.5357065 0.1412055 -0.0237195 0.1782432 -0.6897996 -0.6407165 0.0303693 0.0207844 0.0856925 -0.6028989 0.1324647 -0.0501596 0.2333696 -0.5135655 -0.507714 -0.1022573 -0.2557748 -0.1627548 -0.6520107 -0.0847446 -0.3112249 -0.0703438 -0.5362331 -0.4005436 0.0888891 0.0383584 0.1691554 -0.3516489 -0.0176664 0.2733829 -0.0731764 -0.6568066 -0.5329871 0.2231331 -0.0195237 0.3199543 -0.5738822 0.0057014 -0.0057466 -0.0157142 -0.3697744 0.5565277 -0.1848426 -0.1071195 -0.024133 0.394884 0.0966012 -0.1155635 0.245036 0.3395107 0.239341 -0.1357529 0.0119816 -0.1303227 0.3052166 -0.1709447 0.1342445 -0.1969407 0.3609246 -0.1289863 0.2010481 0.2705969 0.0114501 0.2522804 -0.1763687 0.3523237 -0.3599293 0.127257 0.341733 0.0545067 0.2557836 0.0708676 0.3598496 0.1094592 0.1792999 0.0729698 0.3799211 0.5271662 -0.243191 -0.1356378 -0.4461137 0.3900194 0.1533868 -0.4463776 0.1762747 0.5743556 0.4879658 -0.2771185 -0.0207467 -0.3342181 0.5080057 0.0995548 0.1224153 0.0271424 0.6870476 0.064743 0.0139463 -0.0190258 0.0551517 -0.0534989 0.0636548 -0.0417484 0.0896653 -0.0427182 -0.0717423 0.1079288 0.0024558 0.1044646 -0.0962909 0.0178772 0.0302183 -0.0156026 -0.0121693 0.014811 -0.0172855 -0.070945 -0.0161604 0.0361209 -0.0374241 -0.1096704 -0.00254 -0.0156335 0.0136918 0.0635623 0.0121507 0.1082659 -0.0217154 -0.0851137 -0.0084664 -0.0473604 0.0039975 0.0500134 -0.0011298 -0.0538359 -0.0094692 -0.0580179 0.1225278 -0.0527445 0.0778083 -0.1049763 0.4265544 -0.0240746 -0.0305543 0.0012919 0.3116648 0.0808418 -0.0062481 0.1307974 0.2156942 0.3712237 -0.0338491 -0.084186 -0.0442388 0.281145 -0.0549546 -0.0755242 -0.0467215 0.3446111 0.492473 0.0920938 0.0146598 0.113043 0.3621139 -0.0413118 0.0154433 -0.0643104 0.3067634 0.102887 -0.0558358 0.0736097 -0.0332494 0.3836417 -0.0104173 0.11558 -0.0041415 0.2603485 0.0545257 0.0609945 0.046857 0.0399362 0.0082658 -0.1081542 -0.0082274 -0.0538578 -0.2395438 unknown
polarizability: 98.1189943|-8.6188934|79.0491573|-1.2167201|0.6776356|80.2880077 unknown
InChI: InChI=1S/C6H10O6/c7-1-3(9)5(11)6(12)4(10)2-8/h1,4-6,8,10-12H,2H2
charge 0 multiplicity 1
22 atoms
O  -1.315066 1.431531 1.577761
O  -1.394058 0.419349 -1.263829
O  0.407753 2.166194 -0.459252
O  -3.21255 -1.469227 -0.831602
O  1.918299 -0.017745 -1.481402
O  3.201529 -1.822293 0.393802
C  -0.474536 0.38838 1.002277
C  -1.215323 -0.434521 -0.077153
C  0.81497 1.085815 0.419111
C  -2.59201 -0.922463 0.39294
C  1.762207 0.07984 -0.242251
C  2.527655 -0.832818 0.748467
H  -0.214286 -0.283841 1.840685
H  -0.595153 -1.314612 -0.355321
H  1.333801 1.570194 1.268608
H  -3.169322 -0.069806 0.797664
H  -2.481391 -1.706009 1.169096
H  -1.259416 2.204101 0.947539
H  -2.077634 -0.025388 -1.833241
H  -0.122818 1.744257 -1.202486
H  -4.171604 -1.651699 -0.682012
H  2.44445 -0.535337 1.826099
