program: Gaussian 09
title: 000097432
version: EM64L-G09RevD.01
frameworkgroup: C1[X(C12H6N4O10S)]
method: RPBEPBE
basis: SDD
operation: Freq
keyword: #p
keyword: freq=noraman
keyword: PBEPBE/SDD
title: #p freq=noraman PBEPBE/SDD
converged: YES YES NO NO
title: Mulliken charges:
elementType: S O O O O O O O O O O N N N N C C C C C C C C C C C C H H H H H H
charge: 0.861878 -0.499398 -0.499455 -0.154942 -0.154964 -0.183315 -0.183215 -0.177761 -0.177761 -0.177205 -0.177196 0.022016 0.022082 0.027085 0.027090 -0.137330 -0.137588 0.457963 0.458493 -0.165157 -0.165518 -0.481076 -0.481005 0.442735 0.442748 -0.383224 -0.383110 0.328523 0.328367 0.341743 0.341748 0.308374 0.308374
chargesum: 0.00000
title: Mulliken charges with hydrogens summed into heavy atoms:
elementType: S O O O O O O O O O O N N N N C C C C C C C C C C C C
charge: 0.861878 -0.499398 -0.499455 -0.154942 -0.154964 -0.183315 -0.183215 -0.177761 -0.177761 -0.177205 -0.177196 0.022016 0.022082 0.027085 0.027090 -0.137330 -0.137588 0.457963 0.458493 0.163366 0.162849 -0.139333 -0.139257 0.442735 0.442748 -0.074850 -0.074736
polarizability: 3.71856554e+02 2.12613683e+01 2.20357660e+02 -2.83864572e-03 5.70188755e-02 1.54029677e+02
1716.lowfreq: -7.0064 -6.6963 -0.0018 0.0005 0.0014 4.3095 21.4674 25.9171 31.7215
frequency: 21.4357 25.9072 31.6762 49.4399 53.3489 54.1146 80.4906 91.9893 107.7954 131.3599 137.2511 152.6370 153.1502 155.9185 157.1352 171.7376 203.0534 231.5782 241.7580 284.7901 295.0739 303.2476 325.2159 337.3445 347.6349 389.1523 391.4866 429.3538 432.0948 442.1274 485.4535 489.2624 505.6844 510.8267 525.2297 575.4399 575.7603 638.2913 639.7300 646.2578 650.8468 684.3933 688.3354 718.2552 719.0798 737.8555 738.3672 757.3788 758.1819 796.8872 858.0761 860.5916 879.2687 880.7908 927.9077 963.4188 963.4424 988.9909 992.7047 1011.9450 1012.0777 1067.2933 1068.1369 1118.7060 1118.7654 1140.0163 1140.6236 1203.7022 1204.4877 1214.3331 1220.7236 1234.0450 1235.4373 1363.4181 1364.5225 1381.9986 1383.2611 1405.2713 1405.7075 1417.9444 1419.0007 1438.4387 1440.7109 1582.1127 1584.2406 1599.2577 1599.2908 3145.2526 3145.6991 3182.5090 3182.5876 3189.7330 3189.7655
redmass: 11.5790 12.1084 14.0498 14.8606 15.7863 15.8165 14.4550 7.7794 8.5473 12.0950 13.8668 10.0247 6.0303 6.9543 12.0453 13.4092 12.6178 13.9072 12.4123 8.3531 9.0054 9.6585 12.3205 13.7619 13.4228 10.4605 8.3399 7.1080 3.7339 5.0997 8.8701 8.0523 7.0164 5.5987 8.5213 6.3513 6.0151 7.7118 7.8226 7.8827 7.9734 11.8899 11.6123 4.8799 5.0547 5.3189 5.4046 13.0085 12.8161 16.1801 8.1423 8.1879 1.3721 1.3757 16.2425 1.5052 1.5030 7.5821 7.5482 1.3706 1.3726 1.5609 1.5528 6.0322 4.5809 1.4292 1.5228 9.4776 9.1714 9.9882 11.0191 1.4237 1.4425 4.9560 4.9444 12.0255 11.4905 7.4318 7.6310 9.6581 9.8677 2.6519 2.7093 7.0970 7.0739 9.0026 9.0045 1.0912 1.0914 1.0924 1.0924 1.0949 1.0949
irintensity: 0.5112 0.8263 0.0804 1.2716 0.1980 0.1393 0.3674 9.4128 4.3056 0.2046 5.1031 8.9090 0.4682 1.4385 5.8474 0.8272 14.9746 0.1722 1.4679 3.1988 0.0513 1.1489 3.0482 5.0115 0.0825 84.4308 18.3076 0.2265 1.5511 8.8132 8.6917 7.5015 3.3352 10.1668 80.6960 3.9241 1.1648 0.0905 10.5072 4.0364 21.7300 0.0007 93.4406 7.3476 11.4694 0.7796 3.6221 36.6386 24.1061 54.2439 23.2519 1.6191 30.6408 26.6200 72.3447 20.6675 33.1711 3.3369 0.1270 0.2551 0.0229 127.8368 1.7993 12.4484 2.7400 5.5540 3.0228 0.3890 667.2616 62.2214 105.9304 50.9349 4.5335 121.3731 17.8732 166.0601 0.5482 35.0431 188.5592 95.1558 36.6134 54.3665 0.6465 75.9031 0.2388 24.3142 9.4955 20.6644 11.8043 36.6325 18.1738 11.4827 1.2883
temp: 298.150 k
press: 1.00000 atm
elementType: 16 8 8 8 8 8 8 8 8 8 8 7 7 7 7 6 6 6 6 6 6 6 6 6 6 6 6 1 1 1 1 1 1
symmnumber: 1
zpe: 495236.2 jmol-1
zpe.correction: 0.188625 hartree
zpe.thermalcorrener: 0.212546 hartree
zpe.thermalcorrenthalpy: 0.213490 hartree
zpe.thermalcorrgfe: 0.132521 hartree
zpe.sumelectzpe: -1827.721506 hartree
zpe.sumelectthermal: -1827.697585 hartree
zpe.sumelectthermalent: -1827.696641 hartree
zpe.sumelectthermalfe: -1827.777611 hartree
dipole: 0.0013 0.0021 0.4405
dipole: 0.4405
quadrupole: -195.3699 -173.4417 -172.3820
quadrupole: 5.3988 0.0057 0.0069
quadrupole: -14.9720 6.9562 8.0159 5.3988 0.0057 0.0069
hfenergy: -1827.9101314 hartree
pointgroup: C01 [X(C12H6N4O10S1)]
dipole: 0.0006303 0.0009703 0.1732923 debye
polarizability: 371.9658639|20.8675127|220.2482667|-0.1704137|-0.0083323|154.0297603 unknown
InChI: InChI=1S/C12H6N4O10S/c17-13(18)7-1-3-11(9(5-7)15(21)22)27(25,26)12-4-2-8(14(19)20)6-10(12)16(23)24/h1-6H
charge 0 multiplicity 1
33 atoms
S  0.000999 -0.000562 1.7089
O  -0.006851 1.401993 2.535825
O  0.009969 -1.404901 2.532734
O  -1.831386 3.13896 -1.12529
O  1.828611 -3.139073 -1.126976
O  -0.001334 1.990554 -0.390844
O  0.000144 -1.990166 -0.389176
O  -6.344581 -1.255724 -0.513938
O  6.343072 1.256034 -0.523175
O  -6.019992 0.716097 -1.620159
O  6.016928 -0.715832 -1.628853
N  -1.273635 2.12027 -0.583301
N  1.272086 -2.120453 -0.583599
N  -5.628386 -0.241246 -0.85369
N  5.626386 0.241559 -0.861902
C  -1.64911 -0.041001 0.682049
C  1.649539 0.04105 0.680077
C  -2.128381 0.986139 -0.156194
C  2.127674 -0.986136 -0.158665
C  -2.456714 -1.136211 1.020063
C  2.457618 1.136267 1.016944
C  -3.44139 0.93352 -0.663748
C  3.439767 -0.933394 -0.668533
C  -4.237502 -0.171124 -0.315491
C  4.236342 0.171336 -0.321545
C  -3.769427 -1.21227 0.512893
C  3.769504 1.212422 0.507629
H  -2.045268 -1.911484 1.676371
H  2.047121 1.911481 1.673912
H  -3.820803 1.726513 -1.314331
H  3.81825 -1.726474 -1.319548
H  -4.426241 -2.053972 0.746531
H  4.42659 2.054224 0.740131
