program: Gaussian 09
title: 000099937
version: EM64L-G09RevD.01
frameworkgroup: C1[X(C6H10O4)]
method: RPBEPBE
basis: SDD
operation: Freq
keyword: #pfreq=noraman
keyword: PBEPBE/SDD
title: #p freq=noraman PBEPBE/SDD
converged: YES YES NO NO
title: Mulliken charges:
elementType: O O O O C C C C C C H H H H H H H H H H
charge: -0.259569 -0.260014 -0.447523 -0.447352 -0.118998 -0.119641 -0.135188 -0.134933 -0.334283 -0.333754 0.281880 0.281754 0.242801 0.242643 0.201453 0.226288 0.201372 0.225838 0.343553 0.343674
chargesum: 0.00000
title: Mulliken charges with hydrogens summed into heavy atoms:
elementType: O O O O C C C C C C
charge: -0.259569 -0.260014 -0.103970 -0.103678 0.162882 0.162113 0.107612 0.107710 0.093459 0.093456
polarizability: 8.67277035e+01 2.18142929e+00 6.07776663e+01 -2.64073306e-02 8.70610039e-02 6.81301615e+01
1716.lowfreq: -0.0007 -0.0003 0.0002 11.6583 16.1045 24.7097 71.5770 135.8313 143.0342
frequency: 71.5588 135.7757 143.0202 184.1244 220.4915 232.5199 236.8831 349.9794 361.2235 441.5095 443.8780 598.0706 748.9171 753.7152 816.5147 826.3482 830.1558 843.1893 860.0664 878.2821 939.1129 954.3086 1016.3532 1023.3693 1030.6143 1038.0593 1058.8536 1067.3548 1121.7624 1146.6777 1149.8146 1163.5687 1244.0650 1259.3787 1259.6697 1265.9963 1301.0137 1307.8129 1324.7964 1330.7430 1352.9048 1358.9172 1469.3155 1480.4147 2967.0561 2967.5728 3017.9810 3018.8024 3058.8661 3060.9662 3088.9292 3102.6837 3573.5589 3573.6421
redmass: 6.0802 2.4368 2.4601 1.9275 1.4041 2.3357 3.2365 4.1514 3.9274 3.1411 3.4636 6.0393 5.7776 6.9397 6.2291 3.6158 2.8784 2.7086 3.7152 3.2509 3.1394 2.3262 2.0424 3.9009 2.9311 1.6876 2.2585 3.1219 1.1711 1.2470 1.1773 1.2196 1.1751 1.6375 1.2301 1.2236 1.5286 1.6577 1.2585 1.2723 1.5898 1.6250 1.0898 1.0858 1.0654 1.0654 1.0864 1.0863 1.0991 1.0991 1.0878 1.0910 1.0665 1.0665
irintensity: 6.5707 27.4242 4.5913 1.5058 249.2187 0.6579 70.9502 1.5644 10.9888 2.3242 1.6829 0.0314 0.3839 35.0972 20.2096 0.6990 2.9891 38.8098 29.3246 0.2816 73.6196 14.8549 4.5752 108.4944 107.8487 13.5130 22.4689 2.4298 2.3952 25.1389 11.1502 3.2488 1.0550 11.0170 1.0154 6.0293 22.4091 7.3723 4.4281 7.0246 4.4821 1.8525 2.9271 8.0342 86.2258 16.7511 40.9957 60.9479 66.9797 5.8386 5.9356 18.6463 5.6497 4.9599
temp: 298.150 k
press: 1.00000 atm
elementType: 8 8 8 8 6 6 6 6 6 6 1 1 1 1 1 1 1 1 1 1
symmnumber: 1
zpe: 419118.6 jmol-1
zpe.correction: 0.159634 hartree
zpe.thermalcorrener: 0.169203 hartree
zpe.thermalcorrenthalpy: 0.170148 hartree
zpe.thermalcorrgfe: 0.125046 hartree
zpe.sumelectzpe: -534.680945 hartree
zpe.sumelectthermal: -534.671375 hartree
zpe.sumelectthermalent: -534.670431 hartree
zpe.sumelectthermalfe: -534.715533 hartree
dipole: 0.0041 0.0366 2.6681
dipole: 2.6683
quadrupole: -40.6406 -67.3016 -61.5906
quadrupole: -0.0269 0.0008 0.0413
quadrupole: 15.8704 -10.7907 -5.0797 -0.0269 0.0008 0.0413
hfenergy: -534.8405788 hartree
pointgroup: C01 [X(C6H10O4)]
dipole: -0.0020509 -0.0294745 -1.0493938 debye
dipolederiv: -0.6990784 -0.0669175 0.2135169 0.0028673 -0.4080659 -0.0009776 0.2164 -0.0198261 -0.5102381 -0.7004975 -0.0786798 -0.2097655 -0.0108917 -0.4071476 -0.0058091 -0.2166801 0.0129704 -0.5109708 -0.5444439 -0.0398014 0.3585804 -0.023235 -0.5552559 -0.0448292 0.3773263 -0.0131568 -0.5182907 -0.5450501 -0.0611858 -0.3556602 -0.04559 -0.5519121 0.0464043 -0.376194 0.0144504 -0.5219472 0.3782281 -0.1015365 -0.083446 -0.1485289 0.1319941 0.1148166 -0.2259279 0.08183 0.3544471 0.3773214 -0.0962677 0.0899218 -0.1341638 0.1211736 -0.0997196 0.2353346 -0.066375 0.3666118 0.424951 0.0465478 -0.2837735 -0.0630544 0.3122964 0.0644018 -0.3092817 0.0909421 0.384954 0.4270529 0.0638389 0.2807494 -0.0441789 0.3033896 -0.059322 0.313185 -0.0859444 0.394574 0.4334559 0.0545119 -0.1497226 0.1328975 0.202548 -0.2709959 -0.1946496 -0.096345 0.2736022 0.4365298 0.0635763 0.1461579 0.1454333 0.2246065 0.2741492 0.1861034 0.0995888 0.2508107 0.0484827 0.0336519 0.0033444 0.0237615 0.0340323 0.052514 0.0395044 0.0528781 -0.0735767 0.048302 0.033412 -0.005277 0.0213453 0.0266222 -0.0589524 -0.0408987 -0.0593031 -0.0671238 -0.0107143 -0.0738672 0.0120628 -0.0601709 -0.1000236 -0.0960738 0.0278196 -0.0901863 -0.0249337 -0.0108474 -0.0746125 -0.0073522 -0.061866 -0.0883495 0.1001791 -0.0240575 0.0943029 -0.0366214 0.0094525 -0.0077238 -0.0886713 -0.0566376 0.0081285 0.1139995 -0.020632 0.074582 -0.175824 -0.1515215 0.0780257 0.0671299 0.081711 0.0249174 -0.0195758 0.0231889 0.014143 0.0728614 0.0099571 -0.0029508 0.0876259 -0.0557051 -0.0037043 -0.1242877 0.0226429 -0.0849423 -0.1645628 -0.1533075 0.073946 -0.0706618 0.0802564 0.0252383 0.0220557 -0.0264655 -0.0118588 0.0725401 0.1108462 0.0751538 -0.1033815 0.102937 0.3501862 -0.0005485 -0.1758371 0.0149219 0.2161854 0.1108811 0.0808787 0.0986222 0.112813 0.3493259 -0.0074286 0.1691191 -0.0226719 0.2175025 unknown
polarizability: 86.756371|-2.0029518|60.7546345|0.0521152|0.2218134|68.1245257 unknown
InChI: InChI=1S/C6H10O4/c7-3-1-9-6-4(8)2-10-5(3)6/h3-8H,1-2H2
charge 0 multiplicity 1
20 atoms
O  0.559165 -1.514009 -0.418081
O  -0.557133 1.48283 -0.514339
O  -2.540186 -0.229818 1.12073
O  2.54141 0.296116 1.101827
C  -0.276838 -0.707693 0.508526
C  0.277811 0.737398 0.462576
C  -1.712805 -0.585411 -0.041532
C  1.713546 0.580237 -0.07923
C  1.570482 -0.622549 -1.031629
C  -1.573365 0.557214 -1.066017
H  -0.255236 -1.176022 1.503336
H  0.255604 1.267881 1.425659
H  -2.05067 -1.532254 -0.504738
H  2.051795 1.496345 -0.600402
H  1.222904 -0.275649 -2.027122
H  2.497714 -1.209697 -1.153539
H  -1.232859 0.15129 -2.041423
H  -2.501318 1.136645 -1.216869
H  -3.450812 0.014187 0.819297
H  3.452492 0.03616 0.815572
