program: Gaussian 09
title: 000099969
version: EM64L-G09RevD.01
frameworkgroup: C1[X(C14H15NO2S)]
method: RPBEPBE
basis: SDD
operation: Freq
keyword: #p
keyword: freq=noraman
keyword: PBEPBE/SDD
title: #p freq=noraman PBEPBE/SDD
converged: YES YES NO NO
title: Mulliken charges:
elementType: S O O N C C C C C C C C C C C C C C H H H H H H H H H H H H H H H
charge: 0.928877 -0.527510 -0.544914 -0.540450 -0.283404 0.530041 -0.706947 -0.009729 -0.448849 -0.362360 -0.254892 -0.217371 -0.226955 -0.228075 -0.245937 -0.205333 -0.212552 -0.219878 0.280025 0.317748 0.237608 0.218139 0.242098 0.244647 0.257659 0.286201 0.292412 0.228514 0.224863 0.228817 0.240553 0.240880 0.236075
chargesum: 0.00000
title: Mulliken charges with hydrogens summed into heavy atoms:
elementType: S O O N C C C C C C C C C C C C C C
charge: 0.928877 -0.527510 -0.544914 -0.222702 -0.003379 0.530041 -0.009103 -0.009729 -0.204201 -0.104702 0.031309 0.075041 0.001559 -0.003213 -0.017120 0.035221 0.028328 0.016197
polarizability: 1.74685665e+02 -4.92082825e+00 2.10050544e+02 2.73753583e+01 6.52023578e+00 1.49111397e+02
1716.lowfreq: 0.0019 0.0019 0.0025 3.5086 9.6705 10.5386 22.8321 34.1415 41.0951
frequency: 22.6021 33.9915 41.0023 53.8986 76.0674 128.3681 143.3387 160.0542 183.6663 213.7439 219.6252 230.2014 247.8007 278.6025 322.0973 339.8757 386.2472 402.9896 404.6376 428.8723 451.5635 496.4205 517.6557 550.1509 598.9742 602.7064 616.6008 657.3159 689.8821 707.0571 754.7027 761.2893 773.3744 799.5385 832.3857 849.1904 856.7187 910.7108 927.0381 935.2842 936.1716 978.2768 980.0048 983.9607 988.2479 994.5231 999.1335 1003.9654 1009.3666 1025.8141 1051.5193 1065.9447 1079.5902 1082.8822 1110.5139 1171.6672 1173.0018 1179.9562 1186.0997 1215.7019 1258.1250 1299.6499 1306.5503 1322.4846 1365.9824 1384.6024 1385.6858 1395.9277 1437.9991 1446.4359 1454.0109 1466.0910 1470.9614 1486.2491 1578.8827 1595.8723 1604.9991 1614.3371 2968.1463 2983.4777 3081.2876 3099.7403 3120.5446 3126.5602 3136.9145 3138.3005 3148.8377 3149.2665 3158.6844 3162.9460 3167.9225 3176.0080 3328.9870
redmass: 4.9512 5.1594 3.9225 4.1533 5.6312 5.3471 3.8977 6.5672 4.0036 3.8456 3.4536 1.4530 8.5453 3.2351 4.2985 6.8081 7.4441 2.8335 2.8238 4.5238 6.9897 3.6782 3.4154 3.1536 3.9851 6.4539 6.2865 6.5816 2.3539 1.7136 3.2247 1.4655 1.8301 13.4042 1.9992 1.2486 1.2503 2.0478 1.4483 2.8618 1.7520 5.2799 1.4178 1.4406 3.6212 1.9357 1.6653 1.3533 3.9665 2.1647 2.1460 2.0748 1.5796 1.8636 1.9645 1.0545 1.0553 1.1220 1.1111 2.2392 1.1856 1.2378 1.2908 1.3238 1.8349 8.4221 1.5068 2.1122 2.2672 2.0408 2.0249 1.0474 1.1431 2.0335 5.8408 6.0390 6.9686 6.0624 1.0831 1.0360 1.0993 1.1004 1.0849 1.0877 1.0859 1.0920 1.0961 1.0888 1.0928 1.1015 1.0967 1.1012 1.0743
irintensity: 0.8482 0.8838 0.2980 0.5734 1.4459 4.0161 2.8066 0.6410 4.0028 1.5393 2.3134 0.3708 7.8658 1.1665 4.9162 0.9480 19.3459 0.1970 0.1056 32.1168 61.3013 32.2601 72.3418 6.5945 11.0832 0.1695 1.1237 3.3543 40.0974 64.0983 5.7125 87.9150 45.9179 69.4636 66.2733 2.2406 0.3465 25.6273 3.5510 35.4737 17.8420 1.5248 0.2164 0.1317 3.1955 3.9785 2.7972 0.3963 0.8354 6.3148 21.3925 6.8882 5.9515 17.2033 20.1880 0.2857 0.0858 4.5029 0.7810 23.1567 7.7109 1.3600 2.8245 3.2138 4.7519 4.8781 6.4153 12.4335 15.6537 13.6218 12.3498 14.5402 0.5367 13.5709 1.9721 1.1192 0.2174 1.7398 12.2002 31.5865 30.8409 14.3899 1.7329 1.3802 1.7644 16.2706 26.6458 13.6410 2.0527 18.7456 3.5064 22.9362 10.3054
temp: 298.150 k
press: 1.00000 atm
elementType: 16 8 8 7 6 6 6 6 6 6 6 6 6 6 6 6 6 6 1 1 1 1 1 1 1 1 1 1 1 1 1 1 1
symmnumber: 1
zpe: 673767.0 jmol-1
zpe.correction: 0.256624 hartree
zpe.thermalcorrener: 0.273883 hartree
zpe.thermalcorrenthalpy: 0.274827 hartree
zpe.thermalcorrgfe: 0.210066 hartree
zpe.sumelectzpe: -1144.267707 hartree
zpe.sumelectthermal: -1144.250449 hartree
zpe.sumelectthermalent: -1144.249505 hartree
zpe.sumelectthermalfe: -1144.314265 hartree
dipole: 1.6059 3.9176 -2.5831
dipole: 4.9597
quadrupole: -109.3544 -107.7487 -114.8629
quadrupole: -14.4853 7.5940 7.3368
quadrupole: 1.3009 2.9066 -4.2076 -14.4853 7.5940 7.3368
hfenergy: -1144.5243318 hartree
pointgroup: C01 [X(C14H15N1O2S1)]
dipole: 1.5488444 0.6754027 -0.9759687 debye
polarizability: 182.1664934|19.45239|197.6307003|25.532158|-15.2998398|154.0504133 unknown
InChI: InChI=1S/C14H15NO2S/c1-12(13-8-4-2-5-9-13)15-18(16,17)14-10-6-3-7-11-14/h2-12,15H,1H3
charge 0 multiplicity 1
33 atoms
S  -1.972602 -0.638808 0.588788
O  -1.522654 -0.940507 2.129493
O  -3.513201 -0.826717 0.087369
N  -0.985777 -1.745769 -0.584317
C  0.17427 -2.424749 0.07928
C  1.356701 -1.466043 0.209039
C  0.525988 -3.653306 -0.799405
C  -1.419572 1.110049 0.155003
C  2.063854 -1.37035 1.431713
C  1.785182 -0.693184 -0.899347
C  -2.11321 1.768604 -0.872359
C  -0.38171 1.685621 0.903338
C  3.191745 -0.524427 1.544795
C  2.90961 0.152699 -0.789003
C  3.619341 0.237371 0.433033
C  -1.724164 3.093809 -1.175099
C  -0.009089 3.011731 0.584139
C  -0.674768 3.709072 -0.451488
H  -0.104054 -2.781824 1.093012
H  -1.713531 -2.426632 -0.887399
H  0.761403 -3.341606 -1.831754
H  -0.308441 -4.379171 -0.826747
H  1.412302 -4.161411 -0.382372
H  1.722303 -1.948258 2.298919
H  1.215023 -0.74167 -1.833937
H  -2.936652 1.271099 -1.394459
H  0.108355 1.123602 1.70435
H  3.730466 -0.457272 2.496799
H  3.231143 0.749105 -1.650431
H  4.493494 0.892993 0.518297
H  -2.242762 3.642287 -1.968293
H  0.798706 3.493642 1.144226
H  -0.380899 4.737022 -0.690383
