program: Gaussian 09
title: 000099932
version: EM64L-G09RevD.01
frameworkgroup: C1[X(C19H18O3)]
method: RPBEPBE
basis: SDD
operation: Freq
keyword: #pfreq=noraman
keyword: PBEPBE/SDD
title: #p freq=noraman PBEPBE/SDD
converged: YES YES NO NO
title: Mulliken charges:
elementType: O O O C C C C C C C C C C C C C C C C C C C H H H H H H H H H H H H H H H H H H
charge: -0.243692 -0.250065 -0.259814 -0.552811 0.314903 0.133622 -0.363735 -0.024475 0.197544 -0.395749 -0.545861 0.446583 -0.369344 0.413569 -0.341520 -0.812232 -0.330284 -0.391702 -0.379928 -0.373998 0.321412 -0.536437 0.238977 0.244531 0.226667 0.219247 0.272441 0.281207 0.251239 0.234745 0.228557 0.225567 0.232996 0.252948 0.239723 0.253147 0.243985 0.248696 0.224445 0.224893
chargesum: 0.00000
title: Mulliken charges with hydrogens summed into heavy atoms:
elementType: O O O C C C C C C C C C C C C C C C C C C C
charge: -0.243692 -0.250065 -0.259814 -0.069303 0.314903 0.133622 0.082180 -0.024475 0.197544 -0.123307 -0.264655 0.446583 -0.118105 0.413569 -0.106774 -0.125111 -0.077336 -0.151978 -0.126781 -0.130012 0.321412 0.161597
polarizability: 4.53313302e+02 1.66748708e+00 2.01029662e+02 -1.09300102e+01 -1.53148860e+01 1.25768549e+02
1716.lowfreq: -6.5303 -2.5146 -0.0010 -0.0006 0.0004 6.8318 19.3547 29.8642 47.3872
frequency: 19.2270 29.7970 47.3730 60.3564 70.6802 97.3938 111.6408 131.7157 152.5179 163.9086 180.3165 197.4211 227.6945 233.3110 256.5700 290.0096 313.8541 334.8882 374.8318 377.1009 411.4738 422.3701 434.7285 439.8621 458.3917 476.3743 520.2577 528.9904 538.3150 570.1811 597.5533 622.2401 644.0754 678.2218 702.6969 712.6149 729.6250 747.5609 764.1894 808.3357 816.4652 830.7393 838.0024 858.4836 902.4361 920.3351 933.2036 941.9720 961.8810 965.8588 970.6418 983.7903 985.1194 1000.4548 1011.9295 1027.3039 1050.1913 1075.4409 1112.0808 1112.5536 1119.0633 1141.9939 1157.8460 1179.3805 1187.1300 1197.3749 1208.5520 1229.2908 1236.0723 1244.4378 1273.8371 1287.7315 1307.9871 1329.3366 1353.8379 1362.9603 1383.5571 1391.2668 1396.4619 1399.1667 1428.6580 1436.0449 1443.6438 1465.7339 1467.5852 1471.7185 1472.4377 1475.4637 1483.4986 1490.6750 1502.0835 1563.9913 1565.8055 1615.3888 1619.3787 1628.3757 2964.2677 2968.1796 2974.3872 2979.6639 3036.4487 3050.8842 3054.3303 3086.8942 3089.5374 3091.5703 3125.1072 3129.0035 3130.7433 3148.8913 3155.5795 3164.3198 3164.7913 3178.1748
redmass: 4.5207 4.2170 4.6421 4.0503 1.0856 3.8522 4.1734 3.4205 5.0641 4.0895 4.2755 2.7902 2.7751 1.6574 2.8647 3.6976 4.0377 4.1819 4.8150 4.2618 3.9076 3.1951 4.1242 4.1798 5.4957 3.3494 3.6311 2.6001 3.6679 3.0177 5.3694 6.3305 6.2445 4.7266 5.1148 4.1123 3.9449 4.8152 4.6979 4.2482 1.3459 1.4105 1.6496 4.9701 3.0357 1.4108 1.5996 1.8815 1.4751 1.3726 1.3489 1.8618 6.0554 2.6271 2.5633 2.2398 1.5357 3.1469 1.2623 2.0582 1.5543 1.5381 1.3290 1.4032 1.3520 1.6149 2.6233 2.4195 1.9793 2.7932 1.3834 1.7667 1.3452 1.4573 2.7568 1.9706 2.7107 4.0437 1.9644 1.2971 3.5032 1.1736 1.1020 1.3396 1.0502 1.0522 1.0859 1.1502 1.9596 4.8987 2.9879 6.7953 6.4863 6.9230 6.7590 6.7948 1.0328 1.0657 1.0378 1.0650 1.0967 1.0974 1.1041 1.0985 1.0872 1.0980 1.0893 1.0964 1.0925 1.0910 1.0878 1.0953 1.0944 1.0964
irintensity: 1.3262 0.5421 0.1639 0.9073 0.1717 10.4060 2.4888 3.7428 1.2945 1.0382 0.5140 1.0933 2.2130 0.2105 3.6437 2.0634 4.4032 2.8607 1.1114 1.1875 22.3553 0.8549 0.2737 8.7119 3.5687 14.5750 41.4244 29.4082 7.1924 15.6995 1.9826 6.0771 6.8398 7.2116 3.9009 1.0919 9.2493 5.9661 5.7859 21.0470 9.1705 50.1966 63.3246 14.5294 4.1623 1.7740 5.9887 8.8489 10.7906 1.2213 3.1227 141.1951 21.0205 12.2259 18.4238 9.5830 12.0183 1.8377 0.3256 41.9181 60.9438 6.5740 16.4094 401.2244 0.2369 72.2287 63.0233 8.0258 165.6519 184.3882 74.8448 126.1484 30.3063 5.6487 12.3498 18.3526 47.2514 21.0196 10.9308 7.7931 28.7835 25.1141 7.2409 32.8003 15.5086 18.7401 78.5114 4.0668 55.4184 332.5115 62.2915 37.6145 38.0492 348.0943 7.1092 1.4116 93.9292 11.3123 52.3200 38.7333 13.8092 23.5092 44.8210 15.0399 1.1446 26.4951 19.4917 31.6600 1.1175 6.7148 6.3168 15.8080 18.8967 6.0504
temp: 298.150 k
press: 1.00000 atm
elementType: 8 8 8 6 6 6 6 6 6 6 6 6 6 6 6 6 6 6 6 6 6 6 1 1 1 1 1 1 1 1 1 1 1 1 1 1 1 1 1 1
symmnumber: 1
zpe: 836118.5 jmol-1
zpe.correction: 0.318461 hartree
zpe.thermalcorrener: 0.338256 hartree
zpe.thermalcorrenthalpy: 0.339200 hartree
zpe.thermalcorrgfe: 0.268717 hartree
zpe.sumelectzpe: -958.895443 hartree
zpe.sumelectthermal: -958.875647 hartree
zpe.sumelectthermalent: -958.874703 hartree
zpe.sumelectthermalfe: -958.945187 hartree
dipole: -3.5006 0.8517 -0.4565
dipole: 3.6315
quadrupole: -91.5316 -127.5910 -131.8253
quadrupole: 8.6854 -10.1425 2.1621
quadrupole: 25.4510 -10.6084 -14.8427 8.6854 -10.1425 2.1621
hfenergy: -959.2139036 hartree
pointgroup: C01 [X(C19H18O3)]
dipole: 1.3771914 0.3260395 -0.1957431 debye
polarizability: 453.2475329|0.8986022|143.3504019|11.0007654|-35.5924122|183.513579 unknown
InChI: InChI=1S/C19H18O3/c1-13-3-8-18-17(11-13)19(20)15(9-10-22-18)12-14-4-6-16(21-2)7-5-14/h3-8,11-12H,9-10H2,1-2H3
charge 0 multiplicity 1
40 atoms
O  -2.48364 0.387778 -2.427666
O  -1.485575 -1.599561 1.430448
O  6.372698 1.133722 0.135007
C  -0.173103 0.39397 -1.48049
C  -0.209631 -0.250914 -0.108242
C  -2.854763 -0.253413 0.000296
C  -1.16106 -0.251008 -2.464875
C  -1.507552 -0.779185 0.450252
C  -3.245113 0.309615 -1.254934
C  0.90136 -0.452473 0.683327
C  -3.862508 -0.313927 1.01852
C  -5.165326 0.185222 0.859958
C  -4.558511 0.822267 -1.431254
C  2.291939 -0.021688 0.508035
C  -5.49866 0.771542 -0.395129
C  -6.182935 0.12241 1.985617
C  2.714078 1.102235 -0.272256
C  3.304361 -0.743339 1.206649
C  4.067851 1.45586 -0.37031
C  4.66897 -0.412231 1.105781
C  5.055821 0.694598 0.306666
C  7.434195 0.402006 0.833823
H  -0.387227 1.482396 -1.449914
H  0.845891 0.286137 -1.895459
H  -0.837437 -0.101052 -3.50734
H  -1.269475 -1.338054 -2.270568
H  0.704917 -1.052284 1.584716
H  -3.560741 -0.775759 1.964467
H  -4.809944 1.236917 -2.412265
H  -6.505291 1.175533 -0.558889
H  -6.442721 1.134426 2.351432
H  -7.124031 -0.354109 1.652653
H  -5.797731 -0.45455 2.843269
H  1.973033 1.739098 -0.762044
H  3.007811 -1.593038 1.83334
H  4.387963 2.325477 -0.952222
H  5.409942 -1.004982 1.650058
H  8.365407 0.918409 0.559688
H  7.48001 -0.653134 0.501861
H  7.293127 0.442283 1.931095
