program: Gaussian 09
title: 000099983
version: EM64L-G09RevD.01
frameworkgroup: C1[X(C14H22N6O4)]
method: RPBEPBE
basis: SDD
operation: Freq
keyword: #p
keyword: freq=noraman
keyword: PBEPBE/SDD
title: #p freq=noraman PBEPBE/SDD
converged: YES YES NO NO
title: Mulliken charges:
elementType: O O O O N N N N N N C C C C C C C C C C C C C C H H H H H H H H H H H H H H H H H H H H H H
charge: -0.242581 -0.448473 -0.450982 -0.446835 -0.232185 -0.371563 -0.110848 -0.213516 -0.051535 -0.613537 -0.188182 -0.191240 -0.216939 0.044320 -0.404807 0.236958 0.213898 -0.088573 -0.339113 0.139704 -0.382744 -0.342353 -0.337218 -0.689526 0.301692 0.272138 0.235715 0.249301 0.206518 0.210361 0.347241 0.392541 0.350916 0.232437 0.220190 0.345141 0.211937 0.189303 0.197944 0.197664 0.249207 0.343451 0.331697 0.212028 0.219303 0.211144
chargesum: 0.00000
title: Mulliken charges with hydrogens summed into heavy atoms:
elementType: O O O O N N N N N N C C C C C C C C C C C C C C
charge: -0.242581 -0.101232 -0.058441 -0.101694 -0.232185 -0.020647 -0.110848 -0.213516 -0.051535 0.061611 0.113510 0.080898 0.018776 0.293621 0.012072 0.236958 0.213898 -0.088573 0.113514 0.139704 0.018496 0.053255 -0.088011 -0.047050
polarizability: 2.53084740e+02 1.51155383e+01 2.50755612e+02 5.07414869e+00 -1.40635600e+01 1.42060458e+02
1716.lowfreq: -8.9943 -2.6929 -0.0008 -0.0004 0.0006 6.7255 14.5428 24.7561 29.8808
frequency: 12.7341 24.7430 29.7547 40.4277 56.7414 68.4034 96.8713 106.3923 112.3808 124.8952 144.5065 156.2720 164.7183 184.1712 194.3217 211.8866 222.8834 234.1883 243.3919 248.2298 263.3546 294.5674 296.1472 307.8450 325.7051 345.0113 389.0535 410.3259 429.0379 458.0316 477.1526 501.9395 520.5426 534.1758 540.8366 544.8425 569.1962 589.5698 602.8835 638.7399 646.3173 691.2179 721.3399 733.6033 751.8206 773.8078 783.1235 794.3773 797.0834 869.1201 883.7825 893.1289 911.0517 915.9149 932.2449 937.9681 938.6232 975.3559 983.3113 999.4676 1005.4597 1019.1727 1028.5517 1033.9506 1054.6644 1060.6878 1079.0422 1102.7688 1109.6550 1127.8550 1150.8958 1170.0290 1194.3229 1200.9806 1209.7342 1213.8400 1222.4892 1240.3654 1247.3901 1256.6081 1269.8358 1273.9793 1279.7727 1287.1942 1292.6105 1296.9616 1312.9169 1323.8748 1338.3803 1345.3295 1346.1436 1366.8376 1375.5020 1392.1257 1392.8133 1417.8330 1419.5317 1447.2441 1456.5983 1466.9762 1473.1802 1478.6180 1485.3599 1492.1428 1495.1390 1530.7583 1541.2571 1569.3860 1608.2648 1636.9840 2830.1831 2945.5063 2957.0930 2960.4038 2973.0811 2975.2914 2997.7503 3008.3325 3014.3237 3021.5701 3030.9402 3032.2562 3055.4504 3071.6635 3072.5299 3076.2713 3170.5811 3511.6246 3543.2823 3570.8504 3571.0315 3698.6214
redmass: 4.2167 3.7458 4.5248 3.5310 2.3230 5.4490 3.7477 3.8403 3.1909 3.2510 4.9910 3.5715 2.9741 3.4808 4.5565 2.1498 1.9549 1.1702 4.2342 4.4154 6.5106 5.4065 1.5535 3.0220 3.6498 4.9786 3.1495 6.0680 3.7254 3.8605 3.6213 1.2579 6.7836 2.5936 1.2336 1.5847 4.1311 5.2746 4.4827 8.1023 8.9407 8.9303 5.8939 1.0866 5.3594 6.6867 9.2724 1.2140 2.9523 5.5065 1.4034 2.1371 1.4908 2.3397 1.9177 3.7360 1.9865 3.2505 4.1923 3.3588 3.7664 3.5303 3.1638 3.4337 3.8290 3.9167 2.3509 2.0141 2.7495 3.1177 1.6842 1.3053 1.2853 2.8951 1.6406 1.2860 1.5427 1.2509 1.6448 1.5085 1.5411 1.3555 1.2154 1.4077 1.5718 1.6367 1.6174 1.4570 1.9281 1.3640 1.7315 1.6184 2.0971 1.2435 1.5990 3.3803 1.5787 2.7998 1.0802 1.0717 1.0663 1.0425 1.0719 1.8275 1.0966 1.1599 6.6667 2.2724 3.0036 4.0346 1.0721 1.0551 1.0669 1.0623 1.0602 1.0366 1.0957 1.0965 1.0942 1.0877 1.0984 1.0866 1.0991 1.0871 1.1009 1.0994 1.0924 1.0769 1.0442 1.0665 1.0663 1.1056
irintensity: 0.1445 0.5985 2.2358 0.0624 0.3659 0.8764 0.6476 1.8248 3.6203 1.0767 7.9637 1.6444 31.9117 16.7764 7.8352 52.9668 54.8889 0.4018 11.3833 4.4701 8.3206 3.8592 86.5203 40.1233 32.5459 8.2485 1.1499 2.6383 7.7770 15.0435 23.5299 282.0425 13.2651 31.4420 4.2932 104.1583 5.3705 2.9961 35.5869 25.2879 20.9147 6.6197 13.0183 8.3700 21.4264 62.8038 1.2802 5.6576 8.4844 8.4209 58.1897 37.4238 20.4697 74.9160 55.9211 48.6221 37.0768 61.9757 22.1860 25.9205 29.4098 6.3069 57.4797 15.4016 30.0838 15.0561 4.4652 25.4081 0.4912 12.4045 10.0945 57.3145 8.5770 23.8737 7.4590 13.0416 33.0956 6.7174 39.2252 39.8697 42.2322 0.7285 23.2556 43.2106 63.4446 11.2839 53.4577 7.0185 10.7506 1.9782 1.0154 21.3399 24.8234 19.0434 26.9194 106.0995 1.4664 21.7516 8.9573 1.7191 0.5502 13.1400 11.4569 108.7435 33.6777 92.5263 11.4551 165.3140 441.5120 715.9582 1246.4830 51.2646 29.4499 13.5711 64.2852 36.4126 7.3836 3.1814 21.7087 32.7607 14.8707 25.6305 25.9607 3.7289 92.8528 49.7524 8.4059 63.6425 123.0449 0.8871 13.3459 49.1595
temp: 298.150 k
press: 1.00000 atm
elementType: 8 8 8 8 7 7 7 7 7 7 6 6 6 6 6 6 6 6 6 6 6 6 6 6 1 1 1 1 1 1 1 1 1 1 1 1 1 1 1 1 1 1 1 1 1 1
symmnumber: 1
zpe: 974239.8 jmol-1
zpe.correction: 0.371068 hartree
zpe.thermalcorrener: 0.395185 hartree
zpe.thermalcorrenthalpy: 0.396129 hartree
zpe.thermalcorrgfe: 0.315326 hartree
zpe.sumelectzpe: -1174.254026 hartree
zpe.sumelectthermal: -1174.229910 hartree
zpe.sumelectthermalent: -1174.228966 hartree
zpe.sumelectthermalfe: -1174.309769 hartree
dipole: -3.3788 -0.8342 0.4830
dipole: 3.5137
quadrupole: -139.9548 -121.2119 -142.1122
quadrupole: -11.2411 4.4517 0.4747
quadrupole: -5.5285 13.2144 -7.6859 -11.2411 4.4517 0.4747
hfenergy: -1174.6250948 hartree
pointgroup: C01 [X(C14H22N6O4)]
dipole: -1.3280968 -0.3830665 0.019813 debye
polarizability: 249.2458765|15.5648609|253.0045387|18.6173572|-5.8084192|143.6503953 unknown
InChI: InChI=1S/C14H22N6O4/c1-2-3-4-16-14-19-8-11(15)17-6-18-12(8)20(14)13-10(23)9(22)7(5-21)24-13/h6-7,9-10,13,16,21-23H,2-5,15H2,1H3
charge 0 multiplicity 1
46 atoms
O  0.380499 -2.234521 -0.136455
O  1.179075 -2.620632 2.770016
O  3.70644 -1.026005 0.654458
O  1.562872 -3.418052 -2.605073
N  0.06068 0.068369 0.556071
N  -2.256967 -0.330173 -0.039435
N  -1.227105 1.870398 -0.12806
N  2.263595 1.2605 0.738955
N  2.071509 3.658217 0.287479
N  0.021329 4.67306 -0.316563
C  0.264897 -1.322821 1.004007
C  1.53938 -1.542187 1.837955
C  2.625688 -1.97325 0.789904
C  1.819648 -2.193015 -0.540535
C  2.171085 -3.476716 -1.268026
C  -1.205622 0.538525 0.10762
C  0.918143 1.184034 0.518526
C  0.093312 2.275935 0.137779
C  -3.589064 0.168156 -0.435633
C  0.719629 3.548312 0.034948
C  -4.653497 -0.930715 -0.261036
C  -6.059811 -0.452537 -0.688128
C  2.761514 2.534093 0.610241
C  -7.135918 -1.545599 -0.51604
H  -0.630628 -1.634659 1.566212
H  1.867739 -0.642641 2.390326
H  3.080531 -2.925924 1.120568
H  1.987262 -1.328762 -1.213843
H  1.792793 -4.341928 -0.68369
H  3.278307 -3.536257 -1.341855
H  1.982134 -2.864826 3.295554
H  3.283461 -0.085758 0.667888
H  -2.029897 -1.30227 -0.269054
H  -3.824928 1.044526 0.194185
H  -3.573428 0.526216 -1.486956
H  1.752594 -4.260578 -3.088956
H  -4.673791 -1.255926 0.797882
H  -4.374876 -1.820638 -0.864587
H  -6.030039 -0.124488 -1.746907
H  -6.338469 0.439846 -0.091954
H  3.835573 2.651333 0.77819
H  -0.972611 4.604497 -0.523649
H  0.514866 5.55981 -0.390137
H  -7.206488 -1.8709 0.538832
H  -8.132511 -1.180955 -0.824419
H  -6.898304 -2.436792 -1.126908
