program: Gaussian 09
title: 000099850
version: EM64L-G09RevD.01
frameworkgroup: C1[X(C6H4INO2)]
method: RPBEPBE
basis: SDD
operation: Freq
keyword: #p
keyword: freq=noraman
keyword: PBEPBE/SDD
title: #p freq=noraman PBEPBE/SDD
converged: NO YES NO NO
title: Mulliken charges:
elementType: I O O N C C C C C C H H H H
charge: 0.155552 -0.403422 -0.219698 0.011492 0.269488 0.310217 -0.411204 -0.327943 -0.233060 -0.325172 0.254830 0.280115 0.267949 0.370857
chargesum: 0.00000
title: Mulliken charges with hydrogens summed into heavy atoms:
elementType: I O O N C C C C C C
charge: 0.155552 -0.032565 -0.219698 0.011492 0.269488 0.310217 -0.411204 -0.073113 0.047054 -0.057224
polarizability: 1.53262904e+02 -6.93032270e+00 1.39899830e+02 -1.51395518e-02 -1.20979691e-02 3.43622378e+01
1716.lowfreq: -8.0934 -3.2473 0.0006 0.0008 0.0008 7.1911 99.6634 122.8487 132.1538
frequency: 99.6579 122.8483 132.1482 168.3312 189.3694 286.5486 319.7400 378.7709 431.5308 444.4129 446.6109 574.0804 623.7667 649.1033 711.1998 755.5651 839.0356 850.5747 850.7311 987.9782 1000.0527 1093.8433 1125.9853 1155.8818 1226.7534 1277.0759 1331.3677 1391.9030 1424.5039 1458.0185 1556.8594 1604.1862 3136.3456 3139.8787 3179.7213 3569.3232
redmass: 5.4668 9.5095 14.9150 7.4163 11.0274 9.9474 5.6299 6.0524 1.1270 6.1757 3.1446 4.6385 7.5772 7.8874 3.6875 7.6844 1.3651 6.4494 1.6112 1.3248 3.0753 2.1203 1.7997 1.4538 1.5423 2.1690 7.2462 4.0776 5.4246 2.9964 6.5502 6.7231 1.0894 1.0921 1.0957 1.0662
irintensity: 0.1521 0.1039 2.5282 0.2788 0.5651 6.2009 2.1073 4.1274 168.0579 28.1715 3.1696 1.2487 5.0073 8.4125 6.7545 18.9341 0.0141 65.8787 72.3732 0.7062 62.3336 95.7774 445.4168 10.1809 97.2393 25.0974 109.4349 62.0616 30.3567 116.1308 128.0018 179.9649 0.4172 8.0508 3.5707 86.8345
temp: 298.150 k
press: 1.00000 atm
elementType: 53 8 8 7 6 6 6 6 6 6 1 1 1 1
symmnumber: 1
zpe: 230482.7 jmol-1
zpe.correction: 0.087786 hartree
zpe.thermalcorrener: 0.096953 hartree
zpe.thermalcorrenthalpy: 0.097897 hartree
zpe.thermalcorrgfe: 0.051624 hartree
zpe.sumelectzpe: -446.947522 hartree
zpe.sumelectthermal: -446.938356 hartree
zpe.sumelectthermalent: -446.937412 hartree
zpe.sumelectthermalfe: -446.983684 hartree
dipole: 2.5406 -5.0762 0.0055
dipole: 5.6765
quadrupole: -67.0821 -72.0581 -73.5125
quadrupole: 0.7989 0.0094 -0.0392
quadrupole: 3.8021 -1.1738 -2.6283 0.7989 0.0094 -0.0392
hfenergy: -447.0353086 hartree
pointgroup: C01 [X(C6H4I1N1O2)]
dipole: -2.1105242 -0.727247 0.0666336 debye
dipolederiv: -0.0957358 0.3808119 -0.002422 0.2394361 -0.4121716 0.0006645 -0.0000018 -0.003516 0.0396409 -1.7279819 -0.1446944 0.0372496 -0.2406742 -0.1385277 0.0036204 0.0402964 0.0011954 -0.4135776 -0.6513394 -0.1364342 0.0161193 -0.9837544 -0.9192603 0.0398639 0.0307531 0.0175965 -0.138511 1.3821832 0.5201151 -0.050529 0.8313097 0.7077707 -0.0375912 -0.0555697 -0.0298005 -0.1642305 -1.2439086 -0.3071873 0.0419226 0.1538499 -0.5914463 0.0073503 0.0337371 0.0197757 0.1140031 1.700671 0.1484179 -0.0434588 0.0947802 0.4936454 -0.0084266 -0.0431451 -0.0095918 0.1511599 0.7949195 -0.6225336 -0.0143942 -0.1974377 1.1957832 -0.0153095 -0.0217618 -0.0033747 -0.1080646 -0.8058988 0.2977792 0.0126329 0.6163039 -0.2555622 -0.0151056 0.0080267 -0.00665 -0.1611935 0.4291003 0.068761 -0.0140472 -0.1654869 -0.0360368 0.004447 -0.0096613 -0.0019046 -0.0446604 -0.3916698 -0.2269317 0.0090326 -0.4489083 -0.1617878 0.0123079 0.0114886 0.0063078 -0.1789669 0.027391 -0.0644629 0.0048495 -0.0756754 -0.0200427 0.0050249 0.004918 0.0047475 0.1741879 0.0845175 -0.0375639 0.0025634 0.0261976 0.0229763 0.0013432 0.0015081 0.0031437 0.1593662 0.0244892 0.0767748 0.0029782 0.0640234 0.0294922 0.000335 0.0032461 -0.0002989 0.1733854 0.4732626 0.047148 -0.0024968 0.086036 0.0851674 0.001476 -0.0038344 0.0023698 0.3974612 unknown
polarizability: 153.5664021|-6.5780128|139.4882484|-3.1325058|-1.4702371|34.4703221 unknown
InChI: InChI=1S/C6H4INO2/c7-5-3-4(9)1-2-6(5)8-10/h1-3,9H
charge 0 multiplicity 1
14 atoms
I  1.605203 -2.714764 -0.005929
O  -3.312001 -0.172012 0.086411
O  2.727945 1.691798 -0.10842
N  2.310147 0.476997 -0.075344
C  0.866104 0.325913 -0.033611
C  -1.926917 -0.05657 0.047256
C  0.325599 -0.987074 0.001949
C  -1.066422 -1.186264 0.041838
C  -0.021131 1.444311 -0.02676
C  -1.404392 1.266669 0.01372
H  -1.480266 -2.200747 0.06861
H  0.434061 2.441991 -0.055013
H  -2.100646 2.109553 0.021078
H  -3.607385 -1.117201 0.105313
