program: Gaussian 09
title: 000099843
version: EM64L-G09RevD.01
frameworkgroup: C1[X(C10H16O2)]
method: RPBEPBE
basis: SDD
operation: Freq
keyword: #pfreq=noraman
keyword: PBEPBE/SDD
title: #p freq=noraman PBEPBE/SDD
converged: NO YES NO NO
title: Mulliken charges:
elementType: O O C C C C C C C C C C H H H H H H H H H H H H H H H H
charge: -0.424187 -0.232447 -0.183992 0.376030 -0.189025 -0.194011 -0.554931 -0.485863 -0.476905 -0.776637 -0.790473 0.105053 0.238182 0.257265 0.249599 0.223205 0.263181 0.218200 0.223611 0.231593 0.208559 0.214704 0.238780 0.223434 0.214386 0.229214 0.221379 0.372095
chargesum: 0.00000
title: Mulliken charges with hydrogens summed into heavy atoms:
elementType: O O C C C C C C C C C C
charge: -0.052092 -0.232447 0.054190 0.376030 0.068240 0.055588 -0.068545 -0.044051 -0.036752 -0.099719 -0.125495 0.105053
polarizability: 1.16767488e+02 1.37017890e+00 1.04127121e+02 6.79641442e-01 -3.18267301e+00 9.62131515e+01
1716.lowfreq: -12.7117 -0.0003 0.0002 0.0008 10.7426 15.0746 48.7451 75.6787 148.8452
frequency: 48.6920 75.4099 148.8430 181.3788 223.4319 239.2297 274.3582 299.7915 321.6321 348.1921 380.0726 400.2156 441.7375 470.2646 536.2905 589.6028 612.2639 668.6970 704.2987 742.6773 789.9904 811.1988 842.1286 883.8197 890.4305 917.8336 932.3628 938.9846 951.8786 967.9272 969.6384 993.3097 1002.4832 1030.4235 1052.7715 1065.7897 1101.1786 1111.0511 1137.7379 1168.7982 1186.7499 1195.2101 1206.5949 1221.7114 1240.0739 1254.6655 1263.5845 1282.7262 1294.2161 1298.9441 1309.7493 1356.5188 1380.6218 1401.0216 1464.0574 1467.0072 1475.2952 1480.7833 1488.9150 1494.5044 1509.4408 1655.4740 2974.2429 2979.3510 2996.7160 3011.8737 3019.4150 3033.1450 3046.8010 3051.7565 3064.2268 3070.0596 3073.4846 3075.4153 3081.0675 3085.5943 3098.9873 3500.3805
redmass: 8.8112 3.2532 4.0952 3.3269 1.2978 1.3762 1.4428 3.8497 2.1732 2.7789 2.3989 2.7824 2.7654 2.0175 3.4924 1.5693 3.9554 2.3857 3.7913 3.9649 2.5817 1.5975 2.6947 2.8407 2.5956 2.2948 2.7892 1.9295 1.6428 1.6971 2.2652 1.9151 1.3332 1.6555 1.4882 1.6728 1.2101 1.4020 1.7629 2.0491 1.5705 2.0011 2.0550 1.3144 1.5535 1.7171 1.4174 1.8540 1.6802 1.4662 1.4850 1.8457 1.2009 1.1999 1.0518 1.0655 1.0761 1.0651 1.0617 1.0744 1.0787 7.9593 1.0358 1.0364 1.0594 1.0656 1.0635 1.0852 1.0875 1.1017 1.0991 1.0981 1.0991 1.0940 1.0994 1.0997 1.1018 1.0638
irintensity: 1.1861 0.2761 0.1066 1.3159 0.2182 0.1776 0.1227 3.3129 1.1431 1.6600 1.1793 3.1492 1.9026 1.5242 17.6306 72.6892 15.6155 61.1690 12.8111 4.3602 3.4412 3.3442 3.9411 9.5752 1.8026 0.9790 5.4016 0.5180 0.3675 0.8335 78.7526 9.8634 0.7837 66.2953 74.8358 59.4216 18.2861 7.8175 6.9868 6.4030 8.4126 3.5581 8.6425 1.3940 1.2917 6.3007 2.5659 3.4437 13.7347 4.7440 4.8926 47.2927 18.3611 16.4114 2.0574 4.3169 10.3859 4.1223 14.1687 28.3064 5.1904 188.2321 25.1970 30.4986 34.8402 54.8481 29.5068 10.4652 48.8282 9.5541 1.0560 65.9512 9.4066 55.3983 46.8875 37.6636 21.1432 17.3646
temp: 298.150 k
press: 1.00000 atm
elementType: 8 8 6 6 6 6 6 6 6 6 6 6 1 1 1 1 1 1 1 1 1 1 1 1 1 1 1 1
symmnumber: 1
zpe: 636157.3 jmol-1
zpe.correction: 0.242300 hartree
zpe.thermalcorrener: 0.253734 hartree
zpe.thermalcorrenthalpy: 0.254678 hartree
zpe.thermalcorrgfe: 0.205566 hartree
zpe.sumelectzpe: -540.170450 hartree
zpe.sumelectthermal: -540.159016 hartree
zpe.sumelectthermalent: -540.158072 hartree
zpe.sumelectthermalfe: -540.207184 hartree
dipole: -0.9074 1.1656 -0.7230
dipole: 1.6446
quadrupole: -68.8064 -75.2329 -75.2235
quadrupole: 3.3017 -2.5393 3.2604
quadrupole: 4.2812 -2.1453 -2.1359 3.3017 -2.5393 3.2604
hfenergy: -540.41275 hartree
pointgroup: C01 [X(C10H16O2)]
dipole: 0.3739272 0.4323886 0.3030936 debye
polarizability: 116.6033834|-1.9872225|104.0514031|0.960925|3.3946252|96.4529739 unknown
charge 0 multiplicity 1
28 atoms
O  -2.767531 0.268175 0.990041
O  -2.307994 -1.179964 -0.759896
C  1.49622 0.394818 -0.781709
C  0.223182 1.051947 -0.122232
C  0.497088 -1.411924 0.182495
C  -0.44532 -0.235891 0.588709
C  0.95391 -0.990243 -1.242232
C  2.531477 -0.045409 0.295216
C  1.819044 -1.263674 0.994879
C  -0.668914 1.681752 -1.225437
C  0.530561 2.14659 0.926465
C  -1.880532 -0.464414 0.174738
H  1.92495 1.035552 -1.571729
H  0.021428 -2.402086 0.264757
H  -0.445947 -0.077356 1.681695
H  1.747155 -1.644915 -1.645956
H  0.12385 -0.948852 -1.964879
H  2.797155 0.760972 0.998839
H  3.467069 -0.365952 -0.198911
H  2.426499 -2.183316 0.914948
H  1.628194 -1.085791 2.069333
H  -0.148206 2.548982 -1.672872
H  -0.903479 0.971916 -2.036832
H  -1.624127 2.046435 -0.80443
H  1.121196 2.967557 0.476972
H  -0.411606 2.57773 1.312901
H  1.094989 1.754621 1.790506
H  -3.698913 0.10884 0.673622
