program: Gaussian 09
title: 000099835
version: EM64L-G09RevD.01
frameworkgroup: C1[X(C9H12O4)]
method: RPBEPBE
basis: SDD
operation: Freq
keyword: #pfreq=noraman
keyword: PBEPBE/SDD
title: #p freq=noraman PBEPBE/SDD
converged: YES YES NO NO
title: Mulliken charges:
elementType: O O O O C C C C C C C C C H H H H H H H H H H H H
charge: -0.411058 -0.418315 -0.238254 -0.223844 -0.165247 -0.192540 -0.516130 -0.211880 -0.210937 -0.472456 -0.479612 0.137636 0.113063 0.259606 0.278025 0.232953 0.242804 0.302358 0.297695 0.226932 0.233850 0.226637 0.229151 0.378439 0.381125
chargesum: 0.00000
title: Mulliken charges with hydrogens summed into heavy atoms:
elementType: O O O O C C C C C C C C C
charge: -0.032618 -0.037191 -0.238254 -0.223844 0.094359 0.085485 -0.040373 0.090478 0.086758 -0.011674 -0.023825 0.137636 0.113063
polarizability: 1.08152758e+02 -4.58945483e+00 1.06010149e+02 1.17025238e+00 1.64606514e+00 8.73296274e+01
1716.lowfreq: -15.6985 -11.9041 0.0002 0.0003 0.0005 17.8652 26.0392 45.5658 63.0138
frequency: 25.7325 45.3973 62.9737 125.4859 149.0723 190.9399 252.0318 323.3368 333.7260 371.0970 425.1155 467.5888 532.6366 562.9169 581.7072 612.6313 621.3531 673.3306 681.9392 749.4544 776.6685 807.5853 845.0182 869.6294 890.0590 907.9068 928.9551 956.8413 961.9309 966.8954 985.6815 1022.1713 1048.4892 1054.2857 1070.8133 1084.7474 1121.1042 1139.1791 1163.1633 1177.5519 1204.4238 1221.7324 1235.1831 1245.4758 1260.9687 1266.9967 1285.1836 1296.7894 1302.3701 1305.1357 1330.0074 1371.9718 1473.6870 1475.0636 1493.4791 1654.6870 1655.4419 2992.2050 3005.1578 3012.7558 3019.4803 3051.2438 3060.7769 3079.0514 3080.7349 3085.7231 3096.7865 3509.5043 3514.8666
redmass: 11.1435 6.6975 5.3262 4.9940 4.8234 4.6088 2.7213 3.5552 6.7179 4.0984 2.3937 2.6202 2.7821 3.2056 2.1621 2.1375 1.8476 2.8768 3.2315 3.4919 5.2117 1.4106 2.9971 3.6059 2.5788 3.0323 2.7615 2.0409 3.7895 1.7760 2.2486 2.2875 1.6277 1.7875 1.8120 1.8307 1.1846 1.2406 1.7727 1.4889 1.3783 1.4576 1.2878 1.5267 1.5240 1.4058 1.6039 1.5075 1.5660 1.7495 1.7860 1.9007 1.0867 1.0847 1.0996 8.6989 8.6898 1.0822 1.0597 1.0596 1.0625 1.0845 1.1038 1.0988 1.0958 1.1053 1.0913 1.0639 1.0640
irintensity: 1.3569 0.4348 1.1070 0.7771 1.9273 0.3527 1.1732 5.5201 3.7995 1.6042 5.6826 10.7550 23.6500 19.1405 110.2550 45.8854 80.6876 62.3811 31.2191 7.5550 1.1873 4.9606 15.5289 3.6952 10.7290 6.6055 6.9415 6.3921 48.8256 10.9413 45.9076 54.1334 16.2640 129.2578 87.4533 170.1775 3.2907 9.1638 9.7777 4.8884 12.0145 17.7112 0.7434 2.1279 7.8373 4.9380 11.1977 12.3120 7.4767 20.6125 6.6476 49.5898 11.3745 11.4257 7.7545 225.0222 191.7702 12.6054 28.8902 38.5477 45.4555 2.7768 2.1398 18.3970 33.6728 61.4436 13.2023 26.1138 23.1487
temp: 298.150 k
press: 1.00000 atm
elementType: 8 8 8 8 6 6 6 6 6 6 6 6 6 1 1 1 1 1 1 1 1 1 1 1 1
symmnumber: 1
zpe: 527278.2 jmol-1
zpe.correction: 0.200830 hartree
zpe.thermalcorrener: 0.212444 hartree
zpe.thermalcorrenthalpy: 0.213388 hartree
zpe.thermalcorrgfe: 0.161676 hartree
zpe.sumelectzpe: -650.074778 hartree
zpe.sumelectthermal: -650.063163 hartree
zpe.sumelectthermalent: -650.062219 hartree
zpe.sumelectthermalfe: -650.113931 hartree
dipole: 1.3789 -0.0669 -1.4271
dipole: 1.9856
quadrupole: -78.2412 -68.8651 -79.5499
quadrupole: 3.9385 -1.5400 1.7697
quadrupole: -2.6892 6.6870 -3.9978 3.9385 -1.5400 1.7697
hfenergy: -650.2756072 hartree
pointgroup: C01 [X(C9H12O4)]
dipole: 0.5448026 -0.0266098 0.5592521 debye
dipolederiv: -0.7002552 -0.2794369 -0.4273267 -0.2443222 -0.600429 -0.3286941 -0.3861142 -0.3297268 -0.6481375 -0.3051283 0.0112077 -0.0298958 -0.0025242 -1.2281444 -0.1229493 -0.02956 -0.1698352 -0.4052857 -0.5461604 -0.2269349 0.1475516 -0.1798354 -0.4680567 0.1216281 -0.0710034 0.0096481 -0.9013623 -0.9934504 -0.2423934 -0.0292414 0.0172314 -0.6592521 -0.057412 0.1000821 -0.0363747 -0.3009884 -0.005568 -0.1151933 0.0638802 0.0013823 0.2550753 -0.0435139 0.0035946 -0.0283841 0.1391791 0.028922 0.0188937 0.0165742 -0.0282989 0.1317769 0.0215782 -0.000072 0.0034076 0.0690296 0.0192126 -0.0026165 -0.0423525 -0.0511416 0.0372147 0.0087072 -0.0218217 0.030122 -0.0184289 -0.021262 -0.1446472 0.0292615 -0.1291142 -0.2557551 0.0880052 0.1443878 0.1282575 -0.0229434 -0.2594389 0.116711 0.0431233 0.0137915 -0.029295 -0.0265879 0.1785558 -0.0409038 0.0221593 0.03717 0.0080594 0.0176524 -0.0139019 0.0605427 -0.0510663 -0.0015483 -0.0593446 -0.0124734 -0.0027091 0.030068 -0.0124165 0.055465 0.1095955 -0.0080898 0.0129471 -0.0109236 0.0555496 0.9439509 0.7537609 0.129006 0.6257248 0.7260375 0.101199 0.2075902 0.1305523 1.2734752 1.315299 0.0789234 -0.0539236 -0.0602927 1.4429909 0.1981892 -0.2215656 0.2626865 0.2053589 -0.0195145 0.0119452 -0.1024689 0.0060787 0.0286192 -0.0221325 -0.1064427 -0.0088616 -0.07893 -0.0710623 -0.0669319 -0.0638778 -0.0488052 0.0555148 -0.0214165 -0.0572102 -0.0144068 0.0513267 0.0579403 0.0251447 -0.0113718 0.0025476 -0.1817793 0.0770003 -0.0123512 0.0293142 0.0727944 -0.0270968 0.0328922 0.1087402 0.0677001 0.0457835 -0.0895318 0.1002236 -0.0575546 -0.0535918 0.0391649 0.0037531 0.0470763 0.0011918 0.043691 -0.053125 0.0316803 -0.0699695 -0.0125877 0.1246558 0.0248693 0.0435668 0.0714335 0.0499618 0.0460094 -0.0450259 0.0506098 0.0007074 -0.0030147 0.0780758 -0.0356502 0.1267207 -0.1218967 0.0413717 -0.0621635 0.0451325 0.0501073 -0.0585324 -0.0768054 0.0387384 -0.1164471 0.0426711 0.0463681 0.0761802 0.0353255 0.0123606 0.0539861 -0.00594 0.0220121 -0.0095251 0.0512962 0.1159281 0.0017902 0.048229 -0.1257686 0.0421391 -0.0175575 -0.0198812 -0.0144649 -0.1868948 -0.0881064 -0.0080319 -0.026134 0.0582127 0.2678204 -0.0731959 0.0787086 -0.0780798 0.3248534 0.0585415 0.1255152 0.1056505 0.2080663 0.0829319 0.0573486 0.042515 -0.012514 0.3258787 -0.0119006 0.0403637 -0.0265161 0.3621704 unknown
polarizability: 108.3083104|4.6337174|105.4824084|-0.8567465|3.0554089|87.7018151 unknown
InChI: InChI=1S/C9H12O4/c10-8(11)6-4-1-2-5(3-4)7(6)9(12)13/h4-7,10,12H,1-3H2
charge 0 multiplicity 1
25 atoms
O  2.322414 1.845297 0.923107
O  -1.82489 2.111247 0.21438
O  1.753941 1.439775 -1.287844
O  -3.167369 0.234368 -0.014968
C  0.961386 -1.053765 0.939272
C  -0.823909 -1.488723 -0.421865
C  -0.3988 -1.803174 1.041959
C  0.452665 0.385693 0.539879
C  -0.728325 0.066169 -0.450357
C  1.613426 -1.752993 -0.29187
C  0.382787 -2.055891 -1.226345
C  1.527404 1.256673 -0.069952
C  -2.028643 0.748876 -0.066613
H  1.592071 -1.036607 1.841874
H  -1.809354 -1.862639 -0.736134
H  -0.273677 -2.883987 1.230171
H  -1.083205 -1.383263 1.800463
H  0.092868 0.892345 1.451369
H  -0.460977 0.436345 -1.460912
H  2.113298 -2.683901 0.030313
H  2.372706 -1.125543 -0.788906
H  0.483858 -1.579183 -2.21713
H  0.260956 -3.142176 -1.387097
H  3.034679 2.389966 0.489437
H  -2.70041 2.537893 0.421171
