program: Gaussian 09
title: 000099904
version: EM64L-G09RevD.01
frameworkgroup: C1[X(C19H20O6)]
method: RPBEPBE
basis: SDD
operation: Freq
keyword: #pfreq=noraman
keyword: PBEPBE/SDD
title: #p freq=noraman PBEPBE/SDD
converged: YES YES NO NO
title: Mulliken charges:
elementType: O O O O O O C C C C C C C C C C C C C C C C C C C H H H H H H H H H H H H H H H H H H H H
charge: -0.212693 -0.303074 -0.229487 -0.211813 -0.221613 -0.242242 -0.347868 -0.032487 -0.188703 -0.624548 0.365266 0.342267 -0.222272 -0.131018 -0.562947 0.348953 -0.362879 0.100504 0.085481 -0.705486 -0.828273 0.180222 0.337811 -0.759874 -0.627394 0.288430 0.279770 0.243550 0.251850 0.267750 0.277023 0.260212 0.235607 0.238622 0.280065 0.237894 0.263654 0.224138 0.273628 0.229251 0.216906 0.276268 0.220620 0.233007 0.255919
chargesum: 0.00000
title: Mulliken charges with hydrogens summed into heavy atoms:
elementType: O O O O O O C C C C C C C C C C C C C C C C C C C
charge: -0.212693 -0.303074 -0.229487 -0.211813 -0.221613 -0.242242 -0.059438 0.247283 0.054847 -0.104948 0.365266 0.342267 0.054752 0.129194 -0.088718 0.348953 -0.082813 0.100504 0.085481 -0.203938 -0.101255 0.180222 0.337811 -0.046081 -0.138469
polarizability: 2.51045083e+02 -2.78184169e+00 1.99084121e+02 1.67236598e+01 2.07776560e+01 2.03238254e+02
1716.lowfreq: -11.7275 -4.2409 -0.0008 -0.0006 0.0004 3.1480 28.8163 30.3752 41.3250
frequency: 28.7499 30.3406 41.2790 50.4815 59.5935 67.0571 87.1246 101.8295 125.6714 134.9596 152.9558 156.5787 167.5599 174.3222 186.7696 198.5282 225.2886 272.4092 283.9272 288.6020 304.4009 333.9934 349.3839 363.6510 385.1985 389.9698 401.5221 433.2728 444.4911 465.7290 473.8213 500.7836 510.9052 553.1189 567.2854 593.2927 600.6788 616.3589 629.6939 655.2634 659.9063 736.2294 743.4101 751.7316 763.0730 777.0848 782.8375 787.0457 808.0860 814.3690 837.1827 857.1004 870.5901 872.0604 887.6761 912.6611 929.7572 939.7530 947.0751 949.6339 964.4639 976.5404 992.6697 993.2566 997.4376 1010.9188 1018.6285 1029.1809 1050.1411 1054.3108 1054.7818 1083.6685 1097.7937 1136.0682 1162.2444 1173.6291 1190.5994 1203.2502 1205.6581 1217.1510 1244.6819 1264.0495 1276.3341 1280.4737 1284.7137 1289.2874 1306.9603 1325.2624 1332.4784 1344.5803 1378.7399 1386.1419 1400.7365 1403.2944 1416.0117 1420.5762 1457.8585 1458.7599 1458.9971 1463.2802 1471.2321 1477.4758 1608.1942 1650.6497 1651.3023 1669.5480 1675.1726 1679.8593 1683.6001 2978.5101 2987.5101 2998.4328 3006.5615 3012.2067 3023.1876 3037.9630 3054.2228 3060.3963 3068.5344 3069.2808 3074.4024 3096.7853 3096.8231 3100.3526 3105.8755 3150.8495 3185.3530 3205.7148 3217.8609
redmass: 3.8224 4.5643 5.9886 6.4003 4.4570 5.6596 7.1105 5.0273 5.0630 4.4954 1.5406 2.3932 1.1472 3.9297 5.4561 5.6684 3.3576 3.3422 3.4493 4.7864 3.8717 3.9784 3.4444 3.2717 3.7723 4.3531 3.8892 3.8812 2.7836 3.4229 4.4207 4.7771 3.4098 3.9663 4.1506 4.4038 6.1461 3.9595 1.5644 5.5219 2.3865 5.8630 5.9085 4.8320 4.5798 4.2811 2.1666 2.4722 4.0049 4.8478 2.4361 3.0048 4.2984 1.6060 3.7288 2.3044 2.2120 3.1123 2.0346 2.1614 2.5979 3.2517 1.3221 1.4834 1.7367 1.4276 3.5125 1.7145 1.5854 1.5767 3.7717 2.9604 3.3712 1.4494 1.5690 1.4703 1.5226 2.0555 1.7702 1.5283 1.7678 1.6958 1.4532 1.5069 2.0403 1.5104 1.4710 1.6410 1.6159 1.3919 1.4078 1.5257 1.1625 1.2261 1.2528 1.1687 1.0506 1.1060 1.0983 1.0512 1.0632 1.0750 11.0741 5.2057 8.0257 7.2482 6.8761 11.5611 10.2051 1.0384 1.0375 1.0681 1.0605 1.0783 1.0848 1.0858 1.0959 1.0882 1.0995 1.0961 1.1021 1.0621 1.0975 1.1006 1.0619 1.0890 1.0980 1.1155 1.1157
irintensity: 0.8696 0.7733 3.4721 5.9668 2.8034 3.1919 0.9527 0.8724 2.4902 2.0345 1.2696 0.1707 0.1787 2.1503 0.9519 1.0911 2.4363 4.1246 4.5168 8.3439 3.3263 5.8025 5.1745 1.7627 4.2050 2.5040 1.2431 1.0128 2.5083 0.2959 2.0040 2.9557 0.7985 1.2150 4.5987 9.6515 6.6259 16.1292 10.6854 1.8318 12.7800 4.3171 4.2916 7.2332 2.6113 5.0771 6.1253 8.4075 8.5431 16.4291 15.1690 14.5677 43.0839 52.3371 27.6012 40.1496 1.6035 30.7115 12.7415 28.4445 57.0464 20.0994 63.9208 10.0332 40.2826 44.5790 72.7896 28.7440 6.2196 16.9559 227.2322 162.1173 283.0347 6.4967 9.8194 20.3039 25.7089 1.8848 1.2669 20.9681 35.3429 34.6499 6.7501 20.7188 66.6649 27.4159 7.7090 11.3170 5.0771 1.5100 6.0226 9.3502 22.4961 23.3671 7.9232 27.2749 7.6150 18.9404 16.3789 13.6451 54.6517 9.1085 128.2541 6.5006 11.5194 78.1986 64.7189 222.4213 190.9465 20.2730 13.8183 3.0169 28.5664 12.1882 12.4292 12.5904 9.4002 21.1425 1.9092 18.3581 20.7522 3.0679 20.6440 23.7781 3.7635 7.2714 2.1603 1.7899 4.2638
temp: 298.150 k
press: 1.00000 atm
elementType: 8 8 8 8 8 8 6 6 6 6 6 6 6 6 6 6 6 6 6 6 6 6 6 6 6 1 1 1 1 1 1 1 1 1 1 1 1 1 1 1 1 1 1 1 1
symmnumber: 1
zpe: 920751.2 jmol-1
zpe.correction: 0.350696 hartree
zpe.thermalcorrener: 0.374202 hartree
zpe.thermalcorrenthalpy: 0.375146 hartree
zpe.thermalcorrgfe: 0.297294 hartree
zpe.sumelectzpe: -1185.470147 hartree
zpe.sumelectthermal: -1185.446641 hartree
zpe.sumelectthermalent: -1185.445697 hartree
zpe.sumelectthermalfe: -1185.523548 hartree
dipole: -1.8078 -4.0134 -1.2621
dipole: 4.5792
quadrupole: -160.0777 -141.5989 -148.6903
quadrupole: -4.1118 15.4431 16.1019
quadrupole: -9.9554 8.5233 1.4320 -4.1118 15.4431 16.1019
hfenergy: -1185.8208423 hartree
pointgroup: C01 [X(C19H20O6)]
dipole: 1.1747388 -1.265127 0.5149036 debye
polarizability: 244.3644488|18.1225868|205.4064475|21.9646754|-14.5441919|203.5965628 unknown
InChI: InChI=1S/C19H20O6/c1-9(2)17(20)24-15-8-12-7-13(23-19(12)22)5-10(3)6-14-16(15)11(4)18(21)25-14/h6-7,13-16H,1,4-5,8H2,2-3H3
charge 0 multiplicity 1
45 atoms
O  -1.457281 1.588157 1.429315
O  -1.017129 -1.079282 -0.132424
O  3.923486 0.485484 -0.428209
O  -3.734577 1.859889 1.018272
O  2.769286 1.434298 -2.234019
O  -1.953679 -2.644557 -1.590231
C  -0.644657 1.239864 -0.861642
C  -0.599009 -0.257198 -1.305479
C  -0.188047 1.637389 0.601257
C  0.713272 -0.807629 -1.944531
C  -2.093431 1.719035 -0.84168
C  1.967751 -0.641493 -1.138253
C  0.861311 0.800687 1.255923
C  3.604982 -0.595665 0.552208
C  3.150426 0.098703 1.899043
C  2.1254 1.191569 1.594967
C  2.474074 -1.359324 -0.09688
C  -2.575307 1.743201 0.580185
C  2.861436 0.535209 -1.376137
C  -2.890265 2.06393 -1.881452
C  2.661911 2.607621 1.546822
C  -1.747145 -2.253136 -0.415188
C  -2.213645 -2.910514 0.848237
C  -1.920566 -2.246177 2.177429
C  -2.902863 -4.078387 0.715289
H  -0.031654 1.80345 -1.588317
H  -1.377471 -0.399196 -2.080569
H  0.103795 2.702723 0.568753
H  0.839483 -0.274248 -2.90651
H  0.521035 -1.869227 -2.179919
H  0.573074 -0.24776 1.379694
H  4.529361 -1.176917 0.708471
H  4.050004 0.518545 2.382507
H  2.741243 -0.685062 2.563822
H  2.058815 -2.273131 0.332859
H  -2.538395 2.054543 -2.919288
H  -3.926265 2.369596 -1.695797
H  1.882647 3.360942 1.347246
H  3.446457 2.704921 0.773428
H  3.130844 2.862635 2.51676
H  -0.832082 -2.169489 2.357194
H  -2.313063 -1.214379 2.20635
H  -2.369746 -2.819644 3.005335
H  -3.290032 -4.612882 1.58914
H  -3.093581 -4.504596 -0.275682
