program: Gaussian 09
title: 000099817
version: EM64L-G09RevD.01
frameworkgroup: C1[X(C6H9N3O2)]
method: RPBEPBE
basis: SDD
operation: Freq
keyword: #pfreq=noraman
keyword: PBEPBE/SDD
title: #p freq=noraman PBEPBE/SDD
converged: YES YES NO NO
title: Mulliken charges:
elementType: O O N N N C C C C C C H H H H H H H H H
charge: -0.269507 -0.275717 -0.321851 -0.549946 -0.048565 -0.224684 -0.670761 0.105447 0.207068 -0.136781 -0.226142 0.227874 0.227848 0.208065 0.233249 0.233229 0.310272 0.342999 0.313985 0.313918
chargesum: 0.00000
title: Mulliken charges with hydrogens summed into heavy atoms:
elementType: O O N N N C C C C C C
charge: -0.269507 -0.275717 0.021147 0.077957 -0.048565 0.231038 0.003783 0.105447 0.207068 0.173491 -0.226142
polarizability: 1.45190454e+02 5.77958273e+00 1.01642280e+02 -8.91193393e-03 -6.49961699e-03 5.18640823e+01
1716.lowfreq: -14.8312 -1.8667 -0.0006 0.0002 0.0005 6.0120 22.2465 66.0966 83.9394
frequency: 18.4240 66.0564 83.9393 105.0687 106.7810 131.6073 204.0888 207.9546 244.8729 269.0799 315.4552 350.7221 378.5367 400.5015 462.3524 506.2907 513.1559 574.2666 664.6597 720.5447 739.8165 791.2316 797.4941 861.1529 982.9452 1014.9061 1048.0417 1113.2738 1135.9396 1154.7810 1228.4595 1236.4580 1247.0542 1304.4681 1355.9283 1365.2811 1400.6394 1452.6779 1462.4109 1473.9340 1486.8458 1594.2620 1622.2177 1679.4789 2153.4561 2995.9711 3008.1145 3066.6266 3092.6010 3108.6167 3176.9013 3421.4469 3465.1985 3602.6962
redmass: 2.6573 3.6679 4.4853 4.1466 8.0177 2.9477 5.1806 1.9514 1.2839 2.3152 4.6841 5.1938 4.2265 1.9885 2.6408 2.0807 6.7034 4.2806 1.5624 5.9164 8.3485 4.5235 1.1009 4.1161 1.2891 2.4757 6.0608 2.2268 1.4651 5.4759 1.9387 1.1773 1.1347 2.1365 2.3474 1.9546 1.2738 1.5818 1.0400 1.0597 1.0715 4.6796 2.9053 1.5173 12.6029 1.0360 1.0579 1.1068 1.0985 1.1024 1.0935 1.0768 1.0408 1.1056
irintensity: 1.9515 8.1018 4.7129 0.6824 5.1661 0.1364 4.7371 3.8068 14.6943 32.7395 6.2635 7.0503 5.1989 20.0992 66.1003 169.5146 30.7789 2.8147 65.3825 55.5214 8.9140 6.9890 3.0782 23.3206 28.8962 2.9592 305.7717 4.5300 5.8442 82.4886 422.6377 0.5559 0.0006 21.8634 4.2690 8.0344 22.3273 61.9079 11.8217 4.5423 12.8896 306.1016 175.2302 172.4739 62.7654 21.3249 23.1852 10.8762 30.7156 42.7646 6.6000 57.0529 0.1461 11.2344
temp: 298.150 k
press: 1.00000 atm
elementType: 8 8 7 7 7 6 6 6 6 6 6 1 1 1 1 1 1 1 1 1
symmnumber: 1
zpe: 400543.7 jmol-1
zpe.correction: 0.152559 hartree
zpe.thermalcorrener: 0.165138 hartree
zpe.thermalcorrenthalpy: 0.166082 hartree
zpe.thermalcorrgfe: 0.112344 hartree
zpe.sumelectzpe: -547.853802 hartree
zpe.sumelectthermal: -547.841223 hartree
zpe.sumelectthermalent: -547.840279 hartree
zpe.sumelectthermalfe: -547.894016 hartree
dipole: -3.8560 -1.3387 0.0075
dipole: 4.0818
quadrupole: -27.4710 -83.4152 -62.7847
quadrupole: -1.3492 -0.0241 -0.0017
quadrupole: 30.4193 -25.5249 -4.8944 -1.3492 -0.0241 -0.0017
hfenergy: -548.0063608 hartree
pointgroup: C01 [X(C6H9N3O2)]
dipole: -1.5195438 0.5191822 -0.0191323 debye
dipolederiv: -1.8956183 0.1082086 -0.0227416 0.3800734 -0.4859069 0.0029895 -0.0188665 -0.0011322 -0.2763822 -0.7101755 -0.1269342 -0.007181 -0.1864718 -1.1071591 -0.0127857 -0.0078667 -0.0116714 -0.339829 -1.0317678 -0.0070663 -0.0086039 -0.6621209 0.1675202 -0.0014224 -0.0140986 0.0076492 -0.4457989 -0.116097 -0.1526113 -0.0031607 -0.3098221 -0.5946092 -0.0128804 -0.006226 -0.0100532 -0.0342779 -0.2478398 -0.0457141 -0.0002582 0.041394 -0.567855 -0.0033721 0.0008585 -0.0045419 -0.2691481 1.0562721 0.0457694 0.0109543 0.1696269 0.2557897 0.0011812 0.012321 -0.000604 0.3619447 -0.1063508 0.0813854 -0.0012442 0.0570968 -0.0039858 -0.0000704 -0.001551 0.0002996 0.0557266 -1.3344022 -0.1011053 -0.0199277 0.1796657 -0.4441674 -0.0016318 -0.0164017 -0.0060121 -0.1014402 2.3186842 0.2408635 0.0339823 0.1400995 1.3204825 0.0159504 0.0325929 0.0172475 0.2546926 1.8643958 -0.2426784 0.0236125 0.1581487 -0.0248049 0.000935 0.0285573 -0.0049823 0.0875386 -0.0829931 -0.0036605 -0.0022356 -0.1095276 0.6575488 0.0061913 -0.0035699 0.0077273 0.0586411 -0.0646671 0.0184336 -0.0245969 -0.0697814 -0.0118182 0.092133 0.0159989 0.1045551 -0.0602177 -0.0650935 0.0207428 0.0249964 -0.0666206 -0.0064573 -0.0927392 -0.0179198 -0.10261 -0.06549 -0.1549825 -0.0778916 -0.0050174 -0.1003291 0.0354172 -0.0025495 -0.005316 -0.0022274 0.1154743 0.1164688 -0.017067 0.0330697 0.0407138 0.0089324 0.1039504 0.0057033 0.1115044 -0.0573809 0.1174609 -0.0130185 -0.0283359 0.0437206 0.0148254 -0.1006957 0.000592 -0.1099226 -0.0642747 0.1716216 0.0125487 0.0003573 -0.0008384 0.0850486 -0.00099 0.0000498 -0.0007008 0.1607781 0.0679863 0.0943179 -0.0033018 0.1891516 0.0488905 -0.0013381 -0.0032078 -0.0027631 0.3583725 0.0478275 0.0811477 0.0493401 0.051099 0.3241191 0.1023713 0.0161142 0.0575283 0.1338763 0.0492704 0.0843296 -0.0497076 0.0547218 0.3281892 -0.095227 -0.0177642 -0.0492905 0.1271949 unknown
polarizability: 145.2271441|-5.5732553|101.5784738|1.3399353|0.5441071|51.8911987 unknown
InChI: InChI=1S/C6H9N3O2/c1-2-11-6(10)5(3-7)4-9-8/h4,9H,2,8H2,1H3
charge 0 multiplicity 1
20 atoms
O  1.808817 -0.044381 -0.009329
O  0.682782 2.007304 0.000239
N  -3.003067 -0.059551 -0.081744
N  -4.191845 0.689838 -0.091393
N  -0.546258 -2.710769 -0.078418
C  3.108952 0.692272 0.019706
C  4.208369 -0.364453 0.020983
C  -0.560933 -0.083439 -0.045045
C  0.660655 0.747647 -0.016128
C  -1.79167 0.569117 -0.055423
C  -0.509623 -1.511554 -0.062845
H  3.153714 1.352584 -0.865511
H  3.127756 1.327835 0.92377
H  5.198599 0.126415 0.042082
H  4.124173 -1.019211 0.904964
H  4.149935 -0.994404 -0.882877
H  -1.822861 1.662923 -0.04202
H  -3.034549 -1.088359 -0.096924
H  -4.744952 0.62273 0.766464
H  -4.716293 0.646655 -0.968652
