program: Gaussian 09
title: 000099857
version: EM64L-G09RevD.01
frameworkgroup: C1[X(C13H20N2O2)]
method: RPBEPBE
basis: SDD
operation: Freq
keyword: #p
keyword: freq=noraman
keyword: PBEPBE/SDD
title: #p freq=noraman PBEPBE/SDD
converged: YES YES NO NO
title: Mulliken charges:
elementType: O O N N C C C C C C C C C C C C C H H H H H H H H H H H H H H H H H H H H
charge: -0.279472 -0.318856 -0.368515 -0.356837 -0.248768 -0.280039 -0.281922 -0.255779 -0.536625 -0.223632 -0.240397 0.166229 0.214717 -0.344822 -0.339878 -0.658506 -0.657487 0.283095 0.251430 0.283085 0.276176 0.242248 0.253338 0.244580 0.235299 0.364468 0.322669 0.210818 0.246874 0.218801 0.261460 0.231991 0.210689 0.211124 0.234101 0.204695 0.223648
chargesum: 0.00000
title: Mulliken charges with hydrogens summed into heavy atoms:
elementType: O O N N C C C C C C C C C C C C C
charge: -0.279472 -0.318856 -0.004047 -0.034168 0.034327 -0.028609 0.001163 0.020398 -0.041039 0.020947 -0.005098 0.166229 0.214717 0.112870 0.140383 -0.004701 0.004957
polarizability: 1.80710939e+02 -1.54073264e+00 1.60682002e+02 -2.82764907e+00 1.42587168e-01 1.18991954e+02
1716.lowfreq: -18.9533 -15.6989 -5.3187 -0.0006 -0.0005 0.0006 10.2139 14.0492 40.0045
frequency: -13.5210 13.7445 39.9364 54.9893 76.6421 87.2326 95.5504 137.4739 141.9112 190.9603 208.6094 233.9892 257.6350 280.3843 305.5514 322.0624 358.1662 391.6110 428.9837 445.2115 462.0157 511.7018 569.3978 594.6522 629.4743 679.0408 707.3819 724.7460 741.1400 774.1053 775.8269 800.3574 816.6334 844.3527 854.3950 873.9159 887.4219 904.9874 915.2108 921.5919 940.1332 947.5894 975.5632 979.2890 983.9220 1009.4685 1055.0726 1071.3092 1077.8467 1092.7453 1095.8654 1111.9731 1119.7769 1143.9464 1151.5187 1155.7017 1174.9329 1205.1098 1216.3185 1240.2060 1254.6811 1266.0052 1269.4369 1275.2613 1280.7386 1295.2849 1302.4142 1312.8524 1326.2653 1353.9358 1356.1025 1382.9663 1391.5201 1459.4527 1469.1609 1471.3961 1474.5141 1478.2071 1481.3021 1482.1892 1510.7108 1544.4897 1573.7763 1578.9745 1620.1869 2980.3817 2982.8331 2983.8439 2990.5857 2997.5673 3021.3800 3022.5219 3052.8419 3062.6507 3066.9283 3080.0318 3087.2032 3093.8726 3097.4557 3100.0006 3118.0446 3147.5944 3182.6401 3291.3664 3554.1269
redmass: 2.4811 2.4697 5.9391 3.9644 3.3878 4.7432 3.9208 2.9902 3.1793 2.2667 1.6038 1.6319 2.5061 4.6000 2.6091 3.2043 4.0000 3.9908 2.8616 3.1153 3.2521 2.2344 2.7387 1.5040 3.4993 3.7757 3.0902 2.1471 2.3260 2.9047 2.1738 1.8802 2.1782 1.1372 2.4208 2.1182 2.1035 2.2294 2.6569 1.5383 2.6558 3.1485 2.6985 1.8827 2.2644 1.9567 2.5086 2.3998 2.5052 1.2342 1.3699 1.6517 2.0596 1.8071 1.8086 2.0496 1.3113 1.4013 1.3622 1.5989 1.8490 1.4076 1.4480 1.4114 1.4187 1.1596 1.5554 1.8208 1.6807 1.3597 1.2868 1.2154 1.2167 1.0868 1.0456 1.0670 1.0558 1.1019 1.0583 1.0895 1.9901 1.8717 5.5643 5.9208 4.2709 1.0351 1.0367 1.0820 1.0669 1.0632 1.0840 1.0610 1.0886 1.0997 1.0973 1.0986 1.0968 1.1024 1.1014 1.1067 1.0907 1.0876 1.1088 1.0837 1.0771
irintensity: 0.2139 0.0740 0.9442 3.3355 1.8598 5.5729 5.1015 1.7405 1.9269 4.0870 4.4858 6.9223 1.3865 4.5654 6.0381 22.2817 6.2545 5.4343 7.9078 1.4962 7.8720 4.7392 29.6573 73.5338 5.3814 4.3807 18.7995 24.7870 10.4777 24.6423 7.4929 9.8504 16.0030 86.3707 8.8950 5.0692 6.6691 7.5588 10.1798 1.1118 2.4435 1.1087 5.5706 8.4134 1.6505 0.7968 1.5638 13.2498 6.9862 4.1088 1.1576 8.7237 5.8098 32.6963 11.0970 11.4749 3.1983 4.9018 12.0163 20.4150 51.7683 5.7707 5.2634 5.6788 92.4481 10.3000 9.0906 13.0161 6.3210 3.9649 2.7245 16.4118 18.7560 21.0460 17.3377 44.9142 6.7726 12.9793 9.5320 25.3506 243.4201 335.8344 129.9780 25.0631 137.6383 28.8879 28.6166 8.4093 44.1326 52.9904 13.5399 24.9813 43.1463 0.9277 12.6580 60.7237 32.1289 38.7605 29.0134 31.3481 8.2822 8.9529 19.3606 339.8419 15.1164
temp: 298.150 k
press: 1.00000 atm
elementType: 8 8 7 7 6 6 6 6 6 6 6 6 6 6 6 6 6 1 1 1 1 1 1 1 1 1 1 1 1 1 1 1 1 1 1 1 1
symmnumber: 1
zpe: 825022.4 jmol-1
zpe.correction: 0.314234 hartree
zpe.thermalcorrener: 0.330709 hartree
zpe.thermalcorrenthalpy: 0.331653 hartree
zpe.thermalcorrgfe: 0.268417 hartree
zpe.sumelectzpe: -766.028470 hartree
zpe.sumelectthermal: -766.011995 hartree
zpe.sumelectthermalent: -766.011051 hartree
zpe.sumelectthermalfe: -766.074288 hartree
dipole: -5.6289 -0.7200 0.9381
dipole: 5.7518
quadrupole: -99.0710 -102.7445 -100.7846
quadrupole: -6.7859 -2.1488 -2.3645
quadrupole: 1.7957 -1.8778 0.0821 -6.7859 -2.1488 -2.3645
hfenergy: -766.3427042 hartree
pointgroup: C01 [X(C13H20N2O2)]
dipole: -2.134265 -0.4321122 0.6156623 debye
polarizability: 179.2339644|-0.0035709|160.508195|-10.1865992|1.5993692|120.6427356 unknown
InChI: InChI=1S/C13H20N2O2/c1-3-14-12(16)10-8-5-6-9(7-8)11(10)13(17)15-4-2/h5-6,8-11,14-15H,3-4,7H2,1-2H3
charge 0 multiplicity 1
37 atoms
O  3.203641 1.027283 -0.370858
O  -0.637203 -1.733493 -0.846598
N  2.209262 -1.033125 -0.871743
N  -2.453602 -0.762066 0.229994
C  0.676534 2.441396 -0.309696
C  -0.811646 1.552079 1.174327
C  0.742659 0.902938 -0.638283
C  -0.204311 0.274247 0.466134
C  0.490876 2.417261 1.239691
C  -0.724142 2.8874 -0.744662
C  -1.618883 2.354622 0.138504
C  2.171604 0.31892 -0.604869
C  -1.122025 -0.804719 -0.108063
C  3.46428 -1.800165 -0.893798
C  -3.433634 -1.774748 -0.20611
C  3.693447 -2.61205 0.400475
C  -4.085868 -2.508741 0.982882
H  1.536145 3.001722 -0.699536
H  -1.308462 1.342092 2.136476
H  0.32425 0.703679 -1.641992
H  0.429299 -0.24778 1.212114
H  1.328915 1.928726 1.766821
H  0.308976 3.41896 1.662234
H  -0.947247 3.451125 -1.654646
H  -2.709798 2.423778 0.093017
H  1.299141 -1.514021 -0.999371
H  -2.782093 0.019767 0.798992
H  3.45083 -2.476863 -1.769427
H  4.283922 -1.073735 -1.032352
H  -4.209741 -1.288431 -0.829221
H  -2.880495 -2.480645 -0.847916
H  3.755882 -1.936449 1.271553
H  2.871085 -3.330383 0.573409
H  4.639468 -3.181271 0.335781
H  -3.322906 -3.032537 1.584442
H  -4.630968 -1.810341 1.645551
H  -4.810993 -3.25703 0.614845
