program: Gaussian 09
title: 000099812
version: EM64L-G09RevD.01
frameworkgroup: C1[X(C16H14O)]
method: RPBEPBE
basis: SDD
operation: Freq
keyword: #pfreq=noraman
keyword: PBEPBE/SDD
title: #p freq=noraman PBEPBE/SDD
converged: YES YES NO NO
title: Mulliken charges:
elementType: O C C C C C C C C C C C C C C C C H H H H H H H H H H H H H H
charge: -0.232712 0.225831 0.292342 0.429311 0.016031 -0.361203 -0.840774 -0.371431 -0.371338 -0.371863 -0.394093 -0.235046 -0.231751 -0.245265 -0.244346 -0.231922 -0.236176 0.245755 0.223158 0.236899 0.285504 0.265130 0.269765 0.255948 0.234612 0.230919 0.231869 0.229152 0.230676 0.232079 0.232938
chargesum: 0.00000
title: Mulliken charges with hydrogens summed into heavy atoms:
elementType: O C C C C C C C C C C C C C C C C
charge: -0.232712 0.225831 0.292342 0.429311 0.016031 -0.115448 -0.095213 -0.106302 -0.101574 -0.115915 -0.159481 -0.004127 0.000119 -0.016112 -0.013670 0.000157 -0.003238
polarizability: 2.77689620e+02 -1.21314856e+01 1.81163883e+02 1.65558562e+01 3.83426663e+00 1.08367035e+02
1716.lowfreq: -6.8263 -1.8262 -0.0007 -0.0005 -0.0001 13.5274 24.7295 50.6384 52.8239
frequency: 24.6354 50.6236 52.7800 69.4388 103.3041 147.0275 170.0525 213.0352 229.4735 277.2528 315.1772 338.6513 373.2210 407.0544 410.1244 411.8900 434.4790 527.3436 532.0684 605.2380 614.1444 616.5294 656.5552 695.9577 698.8013 710.0452 738.5553 774.7377 793.9404 824.8801 849.6241 862.8033 910.3079 919.1060 943.3964 948.7654 979.4351 988.1830 988.8862 989.7992 998.4306 1003.5142 1011.5489 1028.3637 1033.9578 1040.1410 1083.6089 1088.0758 1149.8724 1173.7791 1174.5441 1188.1211 1196.1792 1231.8541 1263.2123 1316.5381 1329.0105 1367.4698 1381.3775 1385.6641 1401.6958 1432.2395 1438.7464 1465.8475 1476.1950 1482.5635 1487.2363 1525.1240 1577.7707 1585.2832 1606.5183 1608.4663 1617.3684 2972.5116 3059.4665 3096.4258 3099.8043 3120.5683 3127.2351 3131.1271 3137.7768 3144.9128 3149.6658 3158.9768 3162.9792 3169.0163 3187.9263
redmass: 3.7749 4.0029 4.9659 3.7322 4.7769 4.1053 4.8471 4.0838 1.3769 3.0137 3.3813 5.2379 4.9730 2.9830 3.2552 3.2777 3.9648 4.0213 2.8078 6.1493 6.3687 6.3999 5.4261 3.9427 1.7736 1.5419 2.7575 2.0932 2.4685 4.6633 1.2519 1.2506 1.6148 2.6318 1.6402 1.4632 1.4246 5.3972 3.3248 1.7024 1.3352 1.3310 2.1954 2.1269 1.7049 1.5680 1.5833 1.6567 2.5280 1.0551 1.0617 1.1183 1.1160 2.5002 3.5009 1.3398 1.5337 2.3603 8.0284 1.4316 2.1675 2.2609 2.1887 1.0759 2.2074 2.2260 1.0805 8.4466 5.5819 6.1362 6.0195 6.0548 6.5107 1.0399 1.0930 1.0991 1.0879 1.0870 1.0850 1.0875 1.0882 1.0936 1.0925 1.0961 1.0994 1.1011 1.0942
irintensity: 0.6315 0.0340 0.8581 3.1626 0.6040 0.8469 1.9106 1.1524 1.2792 2.3869 1.0839 1.5154 3.5258 0.8179 3.3648 6.2441 0.1425 13.9002 6.9142 13.6023 0.1638 3.5220 11.7152 3.5392 51.1784 88.9062 21.2874 44.5499 15.0335 1.9519 0.1636 2.9457 14.4400 17.6436 10.5325 6.4637 1.8621 0.1020 2.4944 0.5096 1.0830 0.7886 82.6110 4.1224 4.0033 11.5799 9.9389 7.8641 16.4199 0.1029 0.6345 17.8195 3.5280 37.2631 241.1610 3.3859 62.8219 23.6281 3.3626 33.3693 8.1759 6.9356 24.3723 24.3284 2.9079 7.0089 24.7091 196.7828 4.0567 6.0043 20.4622 0.1244 41.7626 22.0585 16.5930 3.3035 9.8171 7.4189 0.1269 0.2016 6.7463 27.0531 18.9740 19.4197 37.1428 20.6846 9.0067
temp: 298.150 k
press: 1.00000 atm
elementType: 8 6 6 6 6 6 6 6 6 6 6 6 6 6 6 6 6 1 1 1 1 1 1 1 1 1 1 1 1 1 1
symmnumber: 1
zpe: 652359.8 jmol-1
zpe.correction: 0.248471 hartree
zpe.thermalcorrener: 0.263062 hartree
zpe.thermalcorrenthalpy: 0.264006 hartree
zpe.thermalcorrgfe: 0.205292 hartree
zpe.sumelectzpe: -692.133626 hartree
zpe.sumelectthermal: -692.119035 hartree
zpe.sumelectthermalent: -692.118091 hartree
zpe.sumelectthermalfe: -692.176805 hartree
dipole: 2.0514 -3.3258 0.7869
dipole: 3.9861
quadrupole: -86.1833 -100.7068 -98.8754
quadrupole: 9.8867 3.0282 3.8086
quadrupole: 9.0719 -5.4516 -3.6202 9.8867 3.0282 3.8086
hfenergy: -692.3820972 hartree
pointgroup: C01 [X(C16H14O1)]
dipole: -0.773408 0.9553366 0.9739241 debye
polarizability: 275.7092082|0.1905131|165.1342618|-27.0005507|30.274135|126.3770686 unknown
InChI: InChI=1S/C16H14O/c1-13(12-14-8-4-2-5-9-14)16(17)15-10-6-3-7-11-15/h2-12H,1H3
charge 0 multiplicity 1
31 atoms
O  1.860074 -1.930144 -1.890023
C  -0.118532 -1.178807 -0.739718
C  2.270182 -0.178547 -0.301289
C  -2.163183 0.225836 0.001419
C  1.358678 -1.138928 -1.024528
C  -0.743502 -0.032943 -0.289402
C  -0.812675 -2.468397 -1.131006
C  2.080064 0.188967 1.05855
C  3.420998 0.2931 -0.989144
C  -3.14258 -0.781731 0.256216
C  -2.580363 1.590502 0.073633
C  3.0151 1.024446 1.709151
C  4.343036 1.141764 -0.344854
C  -4.477727 -0.433387 0.547179
C  -3.916344 1.937223 0.353351
C  4.142297 1.510867 1.007807
C  -4.875349 0.923586 0.589308
H  -0.104695 0.853681 -0.171512
H  -0.991546 -3.117074 -0.250942
H  -1.7841 -2.283119 -1.620717
H  -0.161143 -3.022981 -1.826511
H  1.222277 -0.203818 1.614226
H  3.574827 -0.026712 -2.025005
H  -2.856312 -1.835486 0.258921
H  -1.84014 2.3808 -0.103145
H  2.867847 1.289465 2.762019
H  5.219478 1.510481 -0.889014
H  -5.210848 -1.222837 0.747324
H  -4.210417 2.991799 0.392693
H  4.863633 2.163376 1.512593
H  -5.915032 1.187619 0.812021
