program: Gaussian 09
title: 000099794
version: EM64L-G09RevD.01
frameworkgroup: C1[X(C15H23NO)]
method: RPBEPBE
basis: SDD
operation: Freq
keyword: #p
keyword: freq=noraman
keyword: PBEPBE/SDD
title: #p freq=noraman PBEPBE/SDD
converged: NO YES NO NO
title: Mulliken charges:
elementType: O N C C C C C C C C C C C C C C C H H H H H H H H H H H H H H H H H H H H H H H
charge: -0.285264 -0.062382 -0.364047 -0.369502 -0.390480 -0.387877 -0.399153 -0.407406 -0.129123 0.431299 -0.436184 -0.377439 -0.212319 -0.220690 -0.230338 -0.687561 -0.243968 0.198926 0.171388 0.162536 0.220252 0.203980 0.188398 0.189181 0.205320 0.187896 0.212770 0.206356 0.225931 0.191696 0.229752 0.260781 0.189053 0.198968 0.223419 0.224100 0.201670 0.223173 0.229820 0.227066
chargesum: 0.00000
title: Mulliken charges with hydrogens summed into heavy atoms:
elementType: O N C C C C C C C C C C C C C C C
charge: -0.285264 -0.062382 0.006267 0.013285 0.001898 0.006624 0.001513 0.024881 0.062573 0.431299 -0.206431 -0.116658 0.175702 0.002729 -0.006238 -0.032898 -0.016902
polarizability: 2.07137274e+02 1.41423066e+01 1.59258691e+02 -9.36691125e+00 1.57735272e+01 1.39813417e+02
1716.lowfreq: -27.4490 -8.3317 -0.0007 -0.0006 -0.0002 7.2821 9.4029 27.2820 31.0721
frequency: -22.1050 27.0987 31.0609 46.0202 54.2262 67.1850 102.7760 157.1404 186.5426 215.6420 224.2102 240.8012 248.0694 281.8408 314.3815 351.1093 373.1292 404.8596 430.4181 447.5647 454.4421 496.3624 518.9373 573.9783 616.0844 629.6064 707.8386 744.8861 768.4396 794.7102 804.3859 815.5959 835.3725 852.2336 856.6627 858.9682 899.1183 920.5603 929.1702 956.9894 980.7856 989.0372 995.2995 998.1543 1017.5966 1026.0611 1042.2946 1049.7895 1058.9493 1076.3270 1089.2301 1106.1653 1118.2212 1127.1527 1137.3717 1147.6499 1161.6041 1169.7690 1178.3988 1189.4865 1208.2362 1250.4091 1254.7412 1259.5724 1263.8681 1283.0079 1293.1490 1307.1622 1323.1260 1329.7508 1338.7165 1338.8676 1349.2428 1361.0894 1372.2356 1383.6082 1385.6181 1393.7884 1438.6903 1448.7991 1450.4514 1458.8150 1459.7274 1465.1613 1465.5206 1477.9420 1478.2900 1479.1064 1491.8141 1593.0753 1611.6211 2805.8787 2819.0854 2890.7182 2927.4355 2934.2892 2964.3198 2980.4675 2983.4726 2985.2643 2991.6992 3010.2502 3030.3260 3035.1559 3041.5782 3045.3078 3054.2389 3088.9031 3098.2668 3107.3626 3122.7113 3134.8154 3146.5546 3161.4441
redmass: 3.1237 3.3613 3.5011 2.7326 3.1109 2.3625 3.6858 3.3574 2.8425 2.2078 2.0439 3.2047 1.6884 2.7188 3.4797 2.1153 1.7144 2.8454 3.4306 2.8726 3.5368 3.2350 2.0847 2.4585 6.4168 4.9871 1.7957 2.8107 2.1781 2.2493 1.5527 1.1492 3.2087 1.4621 2.6543 1.2662 2.3636 1.7244 1.8562 1.3077 1.3777 6.2207 2.0088 1.5160 2.7198 2.1880 2.4623 2.1732 4.3364 1.6303 1.5317 2.1861 2.3263 2.0996 1.4490 1.3189 2.3663 1.0698 1.1437 1.5814 2.1161 1.2111 1.2708 1.2983 1.1948 1.4483 1.4097 1.3090 1.2837 1.3005 1.3997 1.4384 1.4559 1.4083 1.5195 1.4109 3.3727 1.3861 2.1397 1.0936 1.0968 1.0416 1.0879 1.0909 1.0905 1.2696 1.5340 1.1660 1.0810 6.1738 6.1418 1.0715 1.0701 1.0695 1.0652 1.0737 1.0627 1.1055 1.0625 1.0609 1.0358 1.0855 1.0936 1.0911 1.0896 1.1032 1.1035 1.0991 1.1008 1.0876 1.0857 1.0911 1.0953 1.1013
irintensity: 0.2130 0.5183 0.3341 0.0087 0.1341 1.5999 1.3206 0.6698 0.1714 3.0074 0.4190 0.8890 3.4214 4.0484 3.3254 0.9775 4.3241 0.1812 0.1095 0.4519 0.6893 6.8415 11.7487 18.1893 0.2324 11.4223 55.5207 2.9678 35.6770 2.5176 1.4756 3.5994 4.2483 3.6567 12.8652 0.3739 6.9136 0.6313 18.6033 4.5565 0.3334 0.2660 20.0506 7.3713 44.9295 4.2688 7.1244 3.7374 124.6236 7.7527 11.7314 38.9300 10.9673 2.8827 5.5935 5.8828 36.5396 0.9561 2.6387 9.3926 2.8226 4.0921 1.9383 1.5743 4.2668 11.9930 4.4127 20.8501 10.5365 5.5781 8.9942 9.3141 2.8127 4.3731 5.6975 1.3193 7.7989 23.4825 10.9791 8.3067 5.9950 9.1007 14.6879 8.8605 7.0779 15.3168 3.3599 7.2639 2.4752 0.9984 5.8433 56.7914 166.7284 97.2001 29.2469 66.9869 41.0725 48.6494 31.3778 37.2019 27.7173 70.2349 64.7569 17.9839 34.5635 16.2647 99.8411 36.4699 36.9967 12.7116 0.0419 18.1806 31.0838 28.8690
temp: 298.150 k
press: 1.00000 atm
elementType: 8 7 6 6 6 6 6 6 6 6 6 6 6 6 6 6 6 1 1 1 1 1 1 1 1 1 1 1 1 1 1 1 1 1 1 1 1 1 1 1
symmnumber: 1
zpe: 916773.2 jmol-1
zpe.correction: 0.349180 hartree
zpe.thermalcorrener: 0.365587 hartree
zpe.thermalcorrenthalpy: 0.366532 hartree
zpe.thermalcorrgfe: 0.303425 hartree
zpe.sumelectzpe: -714.024395 hartree
zpe.sumelectthermal: -714.007988 hartree
zpe.sumelectthermalent: -714.007044 hartree
zpe.sumelectthermalfe: -714.070151 hartree
dipole: -0.0761 -0.7209 -0.7524
dipole: 1.0448
quadrupole: -98.1669 -101.2745 -100.9229
quadrupole: -0.7054 -0.5048 1.4030
quadrupole: 1.9546 -1.1531 -0.8014 -0.7054 -0.5048 1.4030
hfenergy: -714.3735757 hartree
pointgroup: C01 [X(C15H23N1O1)]
dipole: 0.0311814 -0.1792162 0.3686083 debye
polarizability: 206.7569534|-17.0142814|148.504188|-5.1728866|-18.3067816|150.9482405 unknown
InChI: InChI=1S/C15H23NO/c1-2-17-15(14-9-5-3-6-10-14)13-16-11-7-4-8-12-16/h3,5-6,9-10,15H,2,4,7-8,11-13H2,1H3
charge 0 multiplicity 1
40 atoms
O  0.401166 1.563349 -0.574613
N  -1.976625 -0.311929 -0.135818
C  -2.42787 -1.035522 1.07553
C  -2.949639 -0.417246 -1.248615
C  -3.791043 -0.506984 1.566202
C  -4.327538 0.134526 -0.826257
C  -4.844453 -0.590663 0.437886
C  -0.584706 -0.630724 -0.510939
C  0.440197 0.304597 0.182201
C  1.844823 -0.301624 0.209026
C  2.267902 -1.082631 1.313014
C  2.723265 -0.135638 -0.890926
C  0.954745 2.708615 0.166263
C  3.54242 -1.693687 1.318327
C  3.998936 -0.74267 -0.887588
C  0.815726 3.940127 -0.728601
C  4.41232 -1.526239 0.215612
H  -1.666776 -0.908244 1.869397
H  -2.51219 -2.13944 0.87842
H  -3.076545 -1.48122 -1.587267
H  -2.556481 0.160108 -2.104992
H  -3.671348 0.547303 1.882182
H  -4.11654 -1.090146 2.449566
H  -5.0429 0.019475 -1.663569
H  -4.224258 1.216417 -0.615176
H  -5.039803 -1.656671 0.196513
H  -5.805137 -0.153987 0.770891
H  -0.321601 -1.690595 -0.278407
H  -0.453885 -0.495161 -1.600623
H  0.097861 0.486127 1.22615
H  1.59975 -1.209983 2.175058
H  2.397887 0.484985 -1.733544
H  0.387652 2.840017 1.114325
H  2.019308 2.519332 0.423514
H  3.858787 -2.292902 2.179942
H  4.671272 -0.604524 -1.742325
H  1.199591 4.839189 -0.212411
H  1.38378 3.805467 -1.665672
H  -0.243776 4.107899 -0.988224
H  5.402428 -1.996103 0.218647
