program: Gaussian 09
title: 000099825
version: EM64L-G09RevD.01
frameworkgroup: C1[X(C16H24N4O4)]
method: RPBEPBE
basis: SDD
operation: Freq
keyword: #p
keyword: freq=noraman
keyword: PBEPBE/SDD
title: #p freq=noraman PBEPBE/SDD
converged: YES YES NO NO
title: Mulliken charges:
elementType: O O O O N N N N C C C C C C C C C C C C C C C C H H H H H H H H H H H H H H H H H H H H H H H H
charge: -0.188585 -0.272533 -0.212668 -0.207416 -0.019759 -0.431359 0.023287 0.015712 -0.385709 -0.358338 -0.371509 -0.383254 -0.353592 -0.506191 -0.356397 0.157379 -0.695145 -0.800976 0.301234 0.260294 -0.296519 -0.498057 0.445420 -0.368330 0.197067 0.192808 0.199780 0.190883 0.191819 0.190531 0.220999 0.198300 0.189456 0.188359 0.236971 0.213868 0.195052 0.195684 0.210309 0.209836 0.216792 0.252147 0.252769 0.254088 0.377224 0.300480 0.335546 0.292245
chargesum: 0.00000
title: Mulliken charges with hydrogens summed into heavy atoms:
elementType: O O O O N N N N C C C C C C C C C C C C C C C C
charge: -0.188585 -0.272533 -0.212668 -0.207416 -0.019759 -0.054135 0.023287 0.015712 0.004166 0.032324 0.010841 0.036045 0.024223 -0.055353 0.034338 0.157379 -0.058208 -0.041972 0.301234 0.260294 0.003961 -0.162511 0.445420 -0.076086
polarizability: 4.15744237e+02 -4.55584123e+01 2.57471834e+02 -3.65397405e+01 -1.56673136e+01 1.44210306e+02
1716.lowfreq: -16.4210 -2.8452 -0.0010 -0.0007 0.0008 3.4029 5.4863 17.1497 22.9050
frequency: -13.6893 16.9852 22.6392 33.2181 48.6585 53.3698 59.7892 69.7364 75.8677 87.9814 92.0357 115.2739 127.2696 133.9398 139.1907 150.2399 152.6808 165.0105 172.8125 216.9659 227.7791 231.9698 272.9095 300.8722 321.6251 327.5619 361.3199 380.6264 398.8277 432.7740 436.2211 446.8295 477.2337 505.5835 515.4230 541.6994 591.7210 610.3925 650.1808 652.2440 681.2744 705.9973 719.8286 725.5654 726.0015 743.7450 753.2398 783.8590 807.7794 819.1958 848.4916 860.3804 863.3130 887.4570 890.8194 926.6172 963.1232 972.6852 985.8685 998.0825 1010.4229 1011.2808 1014.6444 1033.5851 1047.6185 1055.4793 1055.9717 1077.6325 1080.4172 1100.0672 1118.3095 1125.2253 1136.3192 1166.4199 1185.9256 1211.6883 1212.9405 1220.6890 1232.5969 1251.5380 1255.7279 1270.2770 1278.1173 1281.3453 1289.2716 1291.4024 1292.1073 1304.4200 1321.8177 1339.1471 1341.7584 1351.7847 1353.0822 1359.8280 1385.7446 1387.9492 1391.0710 1447.8989 1451.0769 1459.2140 1461.5702 1462.2131 1466.0689 1471.0690 1473.9587 1475.1866 1477.7063 1483.5008 1484.9234 1488.4291 1517.8666 1574.4504 1586.1531 1624.0403 2949.7998 2950.7800 2954.2900 2960.3856 2966.6898 2968.2251 2969.3774 2971.8784 2974.5491 2984.6418 2992.1478 3003.3678 3017.8949 3031.3290 3041.0279 3041.7926 3066.0525 3067.9387 3071.6397 3109.7386 3180.0452 3189.2842 3200.8747 3236.3228
redmass: 2.7679 5.3433 2.2764 3.6920 6.0832 3.2654 7.6706 3.8165 5.3449 2.2170 2.6673 1.8089 1.8707 1.8783 4.5439 2.3434 4.6177 5.6068 4.1652 1.1413 3.8027 4.5908 4.6817 5.0218 6.3617 3.7218 5.6939 4.9161 6.2334 3.4176 4.1090 3.8236 3.7287 8.2946 3.5561 3.4720 3.7142 5.8652 6.1432 7.7103 8.8511 7.8052 1.0612 4.2633 1.1163 1.1282 12.5205 1.2591 3.5678 1.1887 1.6264 2.3196 1.4241 1.8914 6.5257 1.2538 1.4075 2.8210 2.1913 1.5344 1.6773 1.3539 3.5128 2.0936 2.3589 2.1009 2.9090 2.3148 2.2110 3.9629 2.5871 1.7069 1.3621 8.9298 1.7562 3.4231 1.4037 1.4798 1.9064 1.3498 1.3515 1.9938 1.0505 1.2275 1.1304 1.1457 1.3517 2.2542 1.4365 2.0585 2.3423 1.5984 1.7060 6.9618 4.4584 1.2162 1.2015 3.6687 1.2312 1.2284 1.0944 1.0887 1.0817 1.0773 1.0890 1.0434 1.0983 1.4698 1.3986 1.0974 3.3988 5.6055 5.9163 7.3157 1.0590 1.0590 1.0593 1.0592 1.0583 1.0577 1.0451 1.0364 1.0619 1.0966 1.0986 1.1012 1.1029 1.1033 1.0974 1.1032 1.0996 1.1008 1.0992 1.0963 1.0895 1.0919 1.0962 1.0787
irintensity: 0.3285 0.7692 0.6242 0.0284 0.2560 0.7636 0.2246 0.4186 0.6287 0.0915 1.1185 3.1092 0.0834 0.0858 1.0752 0.6986 0.7568 3.4565 2.5855 0.0255 2.0794 2.5629 3.5947 0.5263 0.9587 3.2900 0.1452 1.2867 0.8590 2.4447 0.1588 1.4644 1.3045 5.5805 12.8390 5.5380 17.4082 4.1642 4.6926 15.5676 6.0469 7.7768 14.3828 1.4181 0.1095 3.9942 10.9559 0.2919 2.2327 92.4168 6.7303 2.3446 21.8593 6.9331 3.8912 0.3123 24.3490 0.9917 15.3660 5.3490 0.4932 0.2411 9.3003 5.3798 2.5473 34.2197 6.2459 0.0215 0.6426 59.8979 33.3103 22.0321 49.1430 367.5100 2.5150 425.6839 17.4296 12.1209 145.0951 2.6495 3.3151 19.9994 1.1445 9.4391 0.9822 2.9170 3.0569 87.4140 3.7077 106.9971 138.2783 0.7014 1.4573 64.2959 39.7589 11.2851 35.4381 4.4746 12.8107 12.8492 1.6396 0.5201 0.8606 4.4374 16.9567 13.0665 6.0845 38.7813 47.3185 27.6832 95.1926 31.1935 143.2646 454.0069 0.1585 1.0054 0.6610 27.1848 8.8355 84.3682 21.8238 39.0273 100.3730 1.1737 1.0077 0.7695 0.7398 7.8679 22.1686 116.4656 32.8904 106.9582 55.4604 24.2287 3.1807 20.1601 0.0366 67.6535
temp: 298.150 k
press: 1.00000 atm
elementType: 8 8 8 8 7 7 7 7 6 6 6 6 6 6 6 6 6 6 6 6 6 6 6 6 1 1 1 1 1 1 1 1 1 1 1 1 1 1 1 1 1 1 1 1 1 1 1 1
symmnumber: 1
zpe: 1019396.6 jmol-1
zpe.correction: 0.388268 hartree
zpe.thermalcorrener: 0.413271 hartree
zpe.thermalcorrenthalpy: 0.414215 hartree
zpe.thermalcorrgfe: 0.329831 hartree
zpe.sumelectzpe: -1141.995817 hartree
zpe.sumelectthermal: -1141.970814 hartree
zpe.sumelectthermalent: -1141.969870 hartree
zpe.sumelectthermalfe: -1142.054254 hartree
dipole: -9.5205 1.5375 1.9500
dipole: 9.8391
quadrupole: -197.4233 -157.7932 -144.3827
quadrupole: 5.1799 5.5891 4.4987
quadrupole: -30.8903 8.7399 22.1504 5.1799 5.5891 4.4987
hfenergy: -1142.384085 hartree
pointgroup: C01 [X(C16H24N4O4)]
dipole: -3.7634057 -0.7469005 -0.5132969 debye
polarizability: 417.5759308|50.9961424|240.4507315|18.18123|-43.5154701|159.3997147 unknown
InChI: InChI=1S/C16H24N4O4/c1-3-4-5-6-7-8-9-13(2)17-18-15-11-10-14(19(21)22)12-16(15)20(23)24/h10-12,18H,3-9H2,1-2H3
charge 0 multiplicity 1
48 atoms
O  5.11093 -2.307436 1.613116
O  2.908191 -2.760634 1.252124
O  5.993962 3.240282 -1.190229
O  7.201998 1.70019 -0.009612
N  0.23537 -0.647576 -0.660549
N  1.43247 -1.0863 -0.08391
N  3.966409 -1.986129 1.120186
N  6.103897 2.123044 -0.544965
C  -5.637354 0.045881 0.304684
C  -4.53059 -0.245927 -0.733494
C  -6.971079 0.48921 -0.33827
C  -3.197088 -0.687734 -0.089968
C  -8.083042 0.77807 0.695347
C  -2.100127 -0.97687 -1.15484
C  -9.416022 1.22167 0.050418
C  -0.80066 -1.462457 -0.553146
C  -10.522188 1.509282 1.088555
C  -0.760647 -2.818161 0.131088
C  2.563697 -0.313461 -0.188433
C  3.823183 -0.728529 0.390578
C  2.533955 0.942038 -0.883565
C  4.980205 0.072426 0.271705
C  4.898058 1.286891 -0.417651
C  3.674564 1.729786 -0.998596
H  -5.287447 0.83403 1.003476
H  -5.811898 -0.861054 0.92076
H  -4.357811 0.660414 -1.350042
H  -4.880967 -1.035422 -1.431081
H  -6.797714 1.397771 -0.952253
H  -7.319441 -0.297799 -1.039714
H  -2.833359 0.102338 0.596308
H  -3.372749 -1.590952 0.52943
H  -7.737294 1.565608 1.3974
H  -8.259316 -0.12984 1.309682
H  -1.900029 -0.059825 -1.737123
H  -2.484965 -1.745267 -1.857363
H  -9.760985 0.434376 -0.650833
H  -9.239421 2.128523 -0.563485
H  -10.214685 2.314445 1.782365
H  -10.740632 0.610133 1.695283
H  -11.463205 1.824643 0.601524
H  0.019452 -3.472015 -0.306737
H  -1.727198 -3.334881 0.031933
H  -0.537649 -2.727064 1.212927
H  1.548866 -1.976691 0.440652
H  1.580791 1.249769 -1.316772
H  5.922543 -0.259647 0.71461
H  3.656723 2.686152 -1.52762
