program: Gaussian 09
title: 000099799
version: EM64L-G09RevD.01
frameworkgroup: C1[X(C12H13ClN2O5S)]
method: RPBEPBE
basis: SDD
operation: Freq
keyword: #p
keyword: freq=noraman
keyword: PBEPBE/SDD
title: #p freq=noraman PBEPBE/SDD
converged: NO YES NO NO
title: Mulliken charges:
elementType: Cl S O O O O O N N C C C C C C C C C C C C H H H H H H H H H H H H H
charge: -0.075892 0.677074 -0.588046 -0.166321 -0.208353 -0.185968 -0.183326 0.017346 0.023833 -0.347348 -0.409081 -0.418606 -0.378985 -0.399979 -0.375107 -0.370623 0.466703 -0.107191 -0.487426 -0.381399 0.434875 0.317650 0.340587 0.246129 0.252131 0.209819 0.244915 0.210452 0.246946 0.212731 0.217770 0.322503 0.339317 0.302869
chargesum: 0.00000
title: Mulliken charges with hydrogens summed into heavy atoms:
elementType: Cl S O O O O O N N C C C C C C C C C C C C
charge: -0.075892 0.677074 -0.588046 -0.166321 -0.208353 -0.185968 -0.183326 0.017346 0.023833 -0.029697 -0.068494 0.079654 0.075748 0.057419 0.055394 -0.370623 0.466703 0.215312 -0.148109 -0.078530 0.434875
polarizability: 3.06543399e+02 2.01534045e+00 2.10674508e+02 9.96672384e+00 2.72896078e+00 1.32519316e+02
1716.lowfreq: -12.8398 -2.4284 0.0012 0.0015 0.0023 7.5610 25.2976 27.5917 38.5015
frequency: 25.0431 26.6194 38.4547 52.4822 80.1267 91.1544 112.1813 134.9097 146.8464 149.5248 157.1734 163.3575 191.8701 220.8877 241.0721 258.5712 287.1550 310.5560 343.0739 345.9353 348.0135 379.1834 421.9684 445.5986 457.2306 480.3325 493.3386 499.1267 510.3787 577.7560 614.4692 644.2352 652.5502 666.8915 686.8163 719.5723 747.3829 757.5862 791.3100 800.2126 813.6721 860.0676 864.6890 868.6910 895.0780 896.9787 966.1907 987.7008 1002.8967 1025.2311 1038.3251 1056.5900 1062.9985 1077.6383 1108.6692 1115.8180 1129.0995 1134.9296 1155.5880 1172.4129 1200.3263 1209.4464 1211.4986 1228.6743 1251.8147 1272.3894 1302.1592 1327.2982 1341.1695 1343.8761 1356.8625 1359.8292 1364.3960 1374.7444 1405.3894 1416.3134 1423.4249 1437.7922 1449.1777 1467.5720 1482.3241 1583.8517 1593.2342 2957.2123 2978.3435 2994.4916 3002.4101 3033.8489 3051.4372 3059.8177 3068.1386 3088.9795 3092.1401 3111.1295 3183.5052 3184.7337
redmass: 5.6490 8.4019 11.5124 15.3814 6.9451 7.7640 6.1705 7.4443 4.7608 9.9011 5.6997 4.7265 6.0674 5.2416 10.4837 3.6000 4.5056 9.4763 2.0461 11.2776 9.4806 5.3257 3.1318 3.9538 3.0440 9.1792 8.0342 5.8605 4.9948 5.9555 3.7779 7.6886 8.5466 2.2899 11.6012 5.3551 4.9917 12.7344 4.2800 1.5451 15.9965 7.7886 2.4036 2.5348 1.3689 1.4675 1.5141 2.8763 6.9073 1.3310 1.4747 1.6378 1.5629 1.7655 1.1273 6.1854 1.1058 1.3912 1.4264 1.7032 9.7118 1.2625 5.4235 1.6103 1.2566 1.1855 1.8929 1.3387 1.6378 1.4844 1.4655 4.6083 1.4816 9.4504 6.6690 11.3374 1.0883 2.6351 1.0818 1.0841 1.0804 8.3216 7.5921 1.0680 1.0606 1.0600 1.0633 1.0976 1.1013 1.0932 1.1024 1.0865 1.0912 1.0886 1.0930 1.0935
irintensity: 0.1183 0.0112 0.5342 0.1004 1.5039 4.3598 1.1199 0.4401 0.7545 7.7301 3.5930 3.8696 1.3605 8.1857 4.9450 2.2515 4.9222 2.4233 1.8868 6.7013 3.2022 2.1108 10.0635 1.5108 5.8844 0.9240 13.5273 33.6303 8.9036 1.9614 17.7865 2.4979 19.1917 16.5048 29.0604 8.5521 4.9938 21.0104 4.1542 37.1524 53.5940 15.5133 4.9441 17.2280 41.8089 18.7770 26.3860 20.6581 10.5613 0.8958 1.4991 3.3736 53.1105 1.8734 0.6179 0.6298 0.5522 9.5910 7.5933 50.8608 316.1606 5.7832 140.0479 50.4990 3.2855 3.4962 2.3814 1.0288 5.5529 0.2569 6.8786 93.5825 1.3788 54.8717 129.0878 13.7649 21.7868 42.1737 16.4680 15.6144 18.7042 26.8686 64.1203 16.2646 10.2016 25.1779 39.7235 9.3970 33.4906 29.4772 24.8346 7.1320 16.5818 0.7276 10.6428 14.8860
temp: 298.150 k
press: 1.00000 atm
elementType: 17 16 8 8 8 8 8 7 7 6 6 6 6 6 6 6 6 6 6 6 6 1 1 1 1 1 1 1 1 1 1 1 1 1
symmnumber: 1
zpe: 637095.0 jmol-1
zpe.correction: 0.242657 hartree
zpe.thermalcorrener: 0.262747 hartree
zpe.thermalcorrenthalpy: 0.263692 hartree
zpe.thermalcorrgfe: 0.192000 hartree
zpe.sumelectzpe: -1807.021204 hartree
zpe.sumelectthermal: -1807.001114 hartree
zpe.sumelectthermalent: -1807.000169 hartree
zpe.sumelectthermalfe: -1807.071861 hartree
dipole: -2.4247 -2.0090 -0.0914
dipole: 3.1501
quadrupole: -155.2932 -151.2702 -139.5343
quadrupole: 0.2892 -3.2485 -4.9226
quadrupole: -6.5940 -2.5710 9.1650 0.2892 -3.2485 -4.9226
hfenergy: -1807.263861 hartree
pointgroup: C01 [X(C12H13Cl1N2O5S1)]
dipole: 1.1175168 -0.1696377 0.5083332 debye
polarizability: 301.8143975|17.5494257|144.366144|-15.315578|-28.9976415|203.5566821 unknown
InChI: InChI=1S/C12H13ClN2O5S/c13-9-3-1-2-4-11(9)21(20)12-6-5-8(14(16)17)7-10(12)15(18)19/h5-7,9,11H,1-4H2
charge 0 multiplicity 1
34 atoms
Cl 3.130691 -0.608173 -3.242053
S  1.217439 0.999003 0.670087
O  1.696788 0.409814 2.152568
O  -2.160689 1.803107 -2.362117
O  0.021388 1.814624 -1.695377
O  -4.790277 -2.084123 1.878379
O  -5.369898 -1.036811 -0.066235
N  -1.217522 1.449797 -1.566794
N  -4.529858 -1.331705 0.86492
C  2.053166 -0.324504 -0.722088
C  2.860705 0.531625 -1.691811
C  2.829944 -1.361926 0.084676
C  4.226045 0.982129 -1.168372
C  4.20938 -0.861818 0.583402
C  5.026695 -0.177483 -0.535504
C  -0.569164 0.281673 0.57038
C  -1.540266 0.577733 -0.414185
C  -0.915825 -0.525455 1.66836
C  -2.85026 0.062572 -0.329636
C  -2.20934 -1.071479 1.768349
C  -3.155145 -0.764987 0.764189
H  1.142018 -0.719127 -1.196808
H  2.265093 1.349921 -2.119677
H  2.957515 -2.242386 -0.57773
H  2.2249 -1.689651 0.952121
H  4.042674 1.765664 -0.400375
H  4.789197 1.464794 -1.986272
H  4.771887 -1.721745 0.992218
H  4.048623 -0.156954 1.420107
H  5.976872 0.211862 -0.125469
H  5.286884 -0.909228 -1.324183
H  -0.140679 -0.689979 2.43144
H  -3.599021 0.301586 -1.089792
H  -2.500559 -1.718369 2.60018
