program: Gaussian 09
title: 000099786
version: EM64L-G09RevD.01
frameworkgroup: C1[X(C11H8N2O4S)]
method: RPBEPBE
basis: SDD
operation: Freq
keyword: #p
keyword: freq=noraman
keyword: PBEPBE/SDD
title: #p freq=noraman PBEPBE/SDD
converged: YES YES NO NO
title: Mulliken charges:
elementType: S O O O O N N C C C C C C C C C C C H H H H H H H H
charge: 0.181230 -0.263540 -0.252326 -0.212256 -0.360964 -0.143498 -0.252842 0.184433 0.557208 0.170158 -0.461031 -0.414295 -0.341532 -0.233354 -0.202921 -0.269562 0.086144 -0.036821 0.256185 0.243733 0.258403 0.268339 0.244176 0.243248 0.351890 0.399796
chargesum: 0.00000
title: Mulliken charges with hydrogens summed into heavy atoms:
elementType: S O O O O N N C C C C C C C C C C C
charge: 0.181230 -0.263540 -0.252326 -0.212256 0.038831 -0.143498 0.099048 0.184433 0.557208 0.170158 -0.204845 -0.170562 -0.083129 0.034985 0.284502 -0.269562 0.086144 -0.036821
polarizability: 3.62639290e+02 8.08933322e+00 1.86114074e+02 1.59647475e-01 3.07319828e-02 6.51213021e+01
1716.lowfreq: -23.7481 0.0013 0.0015 0.0018 2.4013 4.3181 8.9871 28.8474 42.8863
frequency: -23.6331 28.6467 42.8707 63.9753 82.1953 149.7369 150.2509 188.7953 199.8556 200.4610 226.9976 232.2884 291.0507 333.9830 370.8122 403.8109 411.8794 442.7284 476.0264 491.7321 497.2405 573.8718 590.3970 596.0828 604.0751 615.6902 669.5874 685.8333 715.8711 728.6388 758.0985 782.0666 807.9483 816.2667 840.1701 852.5159 925.7882 928.8371 958.7952 966.8464 977.1447 986.0696 1060.3714 1063.7184 1120.5228 1126.4562 1144.4106 1208.2890 1222.0979 1266.4599 1270.9527 1310.2515 1352.1269 1365.6253 1390.7163 1457.1669 1478.8911 1487.7010 1498.0001 1563.3982 1597.1228 1609.0090 1624.8154 1643.8114 3020.1536 3086.1168 3100.9623 3147.2087 3179.4614 3186.4037 3198.7856 3636.6688
redmass: 2.2894 6.2889 13.9905 8.3799 9.0517 9.8793 7.6184 11.7976 9.3742 7.4679 8.3770 6.1095 1.2421 7.3462 9.3968 3.2552 5.9555 12.3248 3.6046 8.9465 1.3629 8.3543 8.9591 2.5783 9.1572 3.7674 7.5366 9.3442 4.6254 4.9874 7.6011 7.1754 6.7755 1.3519 10.5686 1.6093 4.3713 1.3454 1.4562 8.2123 6.1526 5.2620 3.9147 1.4586 1.0380 3.1355 1.8659 1.8389 2.4058 1.9745 2.2686 1.6087 1.8117 1.2890 3.1993 4.0791 1.7864 1.5969 1.4211 6.4417 7.9221 9.0685 8.6666 9.1644 1.0536 1.0865 1.1190 1.0903 1.0921 1.0959 1.0644 1.0829
irintensity: 13.0341 2.0500 0.8961 0.1847 3.9486 5.7317 7.4483 2.6011 16.4560 1.1277 0.3647 0.0755 95.3101 0.4585 10.5086 5.3782 18.1314 0.5862 1.1604 44.6871 173.8376 4.6996 9.4890 26.3905 15.1522 19.9913 6.4993 1.9477 22.8875 2.7501 4.8840 4.7639 16.5067 36.2588 23.4835 24.8774 5.5981 13.9746 12.2761 23.1785 404.0597 93.6182 42.8177 4.3726 0.3598 161.1469 268.6588 101.0979 119.1420 53.5523 185.3776 35.0006 172.9593 2.0206 73.1544 121.5208 107.2947 108.8978 127.0094 428.0707 62.5275 208.9283 9.1198 14.0169 135.7830 0.9577 27.7214 4.2960 1.8473 4.9213 22.6993 208.1907
temp: 298.150 k
press: 1.00000 atm
elementType: 16 8 8 8 8 7 7 6 6 6 6 6 6 6 6 6 6 6 1 1 1 1 1 1 1 1
symmnumber: 1
zpe: 461062.4 jmol-1
zpe.correction: 0.175609 hartree
zpe.thermalcorrener: 0.190724 hartree
zpe.thermalcorrenthalpy: 0.191668 hartree
zpe.thermalcorrgfe: 0.131825 hartree
zpe.sumelectzpe: -1231.061818 hartree
zpe.sumelectthermal: -1231.046703 hartree
zpe.sumelectthermalent: -1231.045759 hartree
zpe.sumelectthermalfe: -1231.105602 hartree
dipole: 4.2783 -4.4937 0.0810
dipole: 6.2052
quadrupole: -106.5551 -106.6839 -113.1831
quadrupole: 11.8253 0.0672 -0.1591
quadrupole: 2.2523 2.1235 -4.3757 11.8253 0.0672 -0.1591
hfenergy: -1231.2374274 hartree
pointgroup: C01 [X(C11H8N2O4S1)]
dipole: 1.8240886 1.4344965 0.7581992 debye
dipolederiv: -0.7204985 -0.0433672 -0.0228701 0.1974335 -0.2919256 -0.1954585 0.1083814 -0.1953928 -0.049123 -1.0280758 -0.3310748 -0.1774388 -0.6927336 -0.6654503 -0.2286654 -0.3889394 -0.2327511 -0.3792717 -1.7291433 -0.323376 -0.1737621 -0.6088281 -0.533071 -0.1554017 -0.3472436 -0.1597928 -0.3306005 -0.7134379 -0.1306834 -0.0718613 -0.4508059 -0.9582693 -0.3465731 -0.2500074 -0.3476671 -0.5257297 -0.9529012 0.3611943 0.2060027 -0.1672528 -0.1517003 0.0963801 -0.1064121 0.1031444 -0.2666522 -1.0436411 0.2134194 0.1188808 0.4361716 -1.2401008 -0.5404614 0.2416376 -0.5369841 -0.5724984 0.0821444 0.0127807 0.0083601 0.8495308 -0.6981237 -0.2181561 0.5138456 -0.2427684 -0.4642483 -0.0898791 0.2781206 0.1593992 1.1717543 0.5630877 0.2815964 0.6626096 0.2859079 0.2123072 -0.4493983 -0.025371 -0.0126033 -0.1172167 -0.0036074 -0.0107423 -0.0642625 -0.0125996 0.0121136 1.6083498 0.4257573 0.2338126 0.0708625 0.0346237 -0.0053272 0.0447059 -0.0061188 0.045561 0.0894753 -0.108348 -0.0626961 0.0545954 -0.0839028 0.0425908 0.0283772 0.0439607 -0.1375231 0.177524 -0.0054678 -0.0029348 -0.0813729 -0.0199623 0.0829832 -0.046641 0.083384 -0.1214124 -0.1914217 -0.0583809 -0.0335067 -0.3429481 -0.0072844 0.0805597 -0.1904056 0.0801091 -0.1060189 1.0861204 0.0017675 -0.0020029 0.0552595 -0.0819683 -0.0110529 0.0275463 -0.010545 -0.0678606 1.0434167 0.2481494 0.1261357 0.5356946 0.6997386 0.0651344 0.28302 0.0653948 0.5988232 -1.4052736 -0.0927222 -0.049182 -0.4837927 0.3582058 0.2728862 -0.2662752 0.2725994 0.0216637 2.0552296 -0.2928636 -0.166815 0.3502872 1.226937 0.5519384 0.1921747 0.5527076 0.5391124 1.3518364 -0.0275738 -0.0192021 -0.4778204 1.1163507 0.565484 -0.2744709 0.5679451 0.4316808 0.103382 0.0652336 0.0367884 0.0727589 0.0530013 -0.0670876 0.0416701 -0.0669088 0.1352206 0.0658403 -0.0860432 -0.0477925 -0.04592 0.0162729 -0.080809 -0.0253429 -0.0807528 0.1157008 0.0157356 0.0645333 0.0365406 0.0686078 0.0629341 -0.0655653 0.039162 -0.0655521 0.143091 0.0533162 0.0125022 0.0072047 -0.0173894 0.037139 -0.0635726 -0.0096257 -0.0639567 0.1155965 -0.0515518 -0.0364377 -0.0768158 -0.0375053 0.0508145 0.0225395 -0.1850406 -0.0288047 -0.0918498 -0.0469772 -0.0808758 0.0107953 -0.1807701 -0.0615288 0.0417167 0.0759532 0.0974384 0.0058704 0.130321 -0.0153246 -0.0087702 -0.1477192 0.371617 -0.0160195 -0.0948778 -0.005068 0.4049238 0.5595072 -0.0255486 -0.0156666 -0.0108809 0.2061728 -0.0989168 -0.009539 -0.0969287 0.3311236 unknown
polarizability: 360.0840052|-19.4286511|159.404785|-11.51864|52.5263819|94.3858755 unknown
InChI: InChI=1S/C11H8N2O4S/c14-10-9(18-11(12-10)13-15)4-6-1-2-7-8(3-6)17-5-16-7/h1-4,13,15H,5H2
charge 0 multiplicity 1
26 atoms
S  -1.71723 1.31741 0.630742
O  3.573338 1.662137 0.822701
O  5.063393 0.0201 -0.10274
O  -3.199685 -1.917886 -1.167725
O  -5.819874 1.761497 0.874699
N  -4.029554 0.026519 -0.085947
N  -4.413598 2.015263 1.025167
C  2.839827 0.606126 0.228466
C  0.932571 -0.689893 -0.491861
C  3.721807 -0.357404 -0.3139
C  1.457219 0.47806 0.160782
C  1.841077 -1.652501 -1.032839
C  3.246319 -1.505165 -0.954725
C  -0.491793 -0.969161 -0.644395
C  5.005902 1.329638 0.60932
C  -1.61665 -0.289483 -0.263793
C  -3.007224 -0.830931 -0.56355
C  -3.552642 1.110652 0.515948
H  0.81494 1.24788 0.593707
H  1.430147 -2.538942 -1.527925
H  3.927397 -2.249676 -1.372983
H  -0.741189 -1.906319 -1.166629
H  5.502723 1.224244 1.588184
H  5.466223 2.102429 -0.029732
H  -4.220005 2.897598 1.49208
H  -5.80504 0.871907 0.383847
