program: Gaussian 09
title: 000010867
version: EM64L-G09RevD.01
frameworkgroup: C1[X(C14H14S)]
method: RPBEPBE
basis: SDD
operation: Freq
keyword: #pfreq=noraman
keyword: PBEPBE/SDD
title: #p freq=noraman PBEPBE/SDD
converged: YES YES NO NO
title: Mulliken charges:
elementType: S C C C C C C C C C C C C C C H H H H H H H H H H H H H H
charge: 0.177620 -0.806492 -0.806714 0.488430 0.488419 -0.378182 -0.378147 -0.378221 -0.378192 -0.220940 -0.220922 -0.220938 -0.220920 -0.237674 -0.237706 0.257377 0.257381 0.257376 0.257378 0.234833 0.234792 0.234824 0.234784 0.226106 0.226106 0.226107 0.226106 0.228702 0.228707
chargesum: 0.00000
title: Mulliken charges with hydrogens summed into heavy atoms:
elementType: S C C C C C C C C C C C C C C
charge: 0.177620 -0.291734 -0.291959 0.488430 0.488419 -0.143349 -0.143355 -0.143397 -0.143408 0.005166 0.005184 0.005168 0.005186 -0.008972 -0.009000
polarizability: 2.56207466e+02 -7.52855574e-03 1.55750277e+02 -5.57007587e-03 -2.08029285e-03 1.03793077e+02
1716.lowfreq: -11.1067 -7.4690 -0.0018 0.0002 0.0020 2.2591 13.1154 17.5188 30.0170
frequency: 0.9703 11.3765 29.5681 38.4394 55.0319 103.5455 143.3078 215.3187 275.9428 325.5807 325.7730 402.5666 402.7058 470.0340 473.5127 547.1763 560.7270 617.1957 617.3288 640.6742 671.2841 699.9086 701.5278 772.4594 778.9323 797.2423 819.2624 850.4017 850.8280 876.9064 909.5970 922.0445 925.4987 975.6124 975.8132 989.5900 989.7319 994.3506 994.4716 1026.6893 1027.0442 1067.3461 1072.9911 1119.6889 1129.6191 1172.3397 1172.3621 1186.8457 1187.6059 1209.0807 1222.2536 1222.5263 1262.9507 1325.0333 1325.4950 1385.2813 1385.7928 1439.8857 1440.3449 1456.4103 1463.1307 1484.1166 1484.1697 1593.4733 1593.8972 1613.5068 1613.9422 3006.7818 3010.2422 3076.0671 3081.8102 3120.1964 3120.3176 3122.3723 3122.6146 3135.2857 3135.4543 3146.8018 3146.8993 3163.6678 3163.8193
redmass: 4.3919 3.6712 3.4607 5.7566 6.6006 5.5282 6.6433 4.6904 5.6067 2.2953 2.3350 2.7987 2.8013 3.5888 4.0632 5.1676 5.7407 6.3302 6.3424 4.8055 4.7903 1.7145 1.5722 1.9628 2.3577 4.5031 3.7078 1.2505 1.2498 1.4466 1.5201 1.4348 1.4894 1.3914 1.3911 5.5991 5.5158 1.3501 1.3559 2.1988 2.1846 1.4636 1.5043 1.1098 1.0888 1.0514 1.0514 1.1130 1.1121 1.1557 2.7160 2.8345 1.3296 1.2775 1.2765 8.7318 8.5646 2.2072 2.2057 1.1112 1.1157 2.3590 2.3608 6.0977 6.0910 6.1386 6.1649 1.0562 1.0568 1.1087 1.1087 1.0850 1.0849 1.0880 1.0880 1.0919 1.0920 1.0964 1.0964 1.1017 1.1017
irintensity: 0.0535 0.0000 0.0001 0.1426 1.8398 1.3491 0.2496 1.5162 0.2659 0.0890 1.1775 0.0000 0.0030 9.5118 3.7086 1.7490 0.7088 0.0004 0.2221 39.1183 24.5968 28.1207 105.2403 11.6149 35.5158 1.0079 7.2236 0.0004 0.0866 0.0000 0.6401 1.3667 4.3981 0.0011 0.0506 0.2850 0.0132 0.0898 0.1325 13.8494 2.2592 0.0006 16.5378 0.0004 5.5434 0.0070 0.1042 2.8718 0.2623 17.9129 2.5062 3.0017 0.3291 0.0012 0.3030 0.0006 0.1922 0.0026 15.2698 5.2440 5.4354 25.7360 7.9977 0.0865 2.1794 0.3288 7.8753 62.5510 1.8387 23.9922 0.0500 8.1459 4.7760 0.9356 1.6082 18.1817 12.3358 6.7692 77.9902 43.4977 6.6065
temp: 298.150 k
press: 1.00000 atm
elementType: 16 6 6 6 6 6 6 6 6 6 6 6 6 6 6 1 1 1 1 1 1 1 1 1 1 1 1 1 1
symmnumber: 1
zpe: 616007.4 jmol-1
zpe.correction: 0.234625 hartree
zpe.thermalcorrener: 0.248579 hartree
zpe.thermalcorrenthalpy: 0.249523 hartree
zpe.thermalcorrgfe: 0.186147 hartree
zpe.sumelectzpe: -938.882257 hartree
zpe.sumelectthermal: -938.868304 hartree
zpe.sumelectthermalent: -938.867359 hartree
zpe.sumelectthermalfe: -938.930735 hartree
dipole: -0.0008 0.0000 1.4707
dipole: 1.4707
quadrupole: -85.7883 -85.9976 -97.7566
quadrupole: -0.0014 0.0004 -0.0005
quadrupole: 4.0592 3.8499 -7.9091 -0.0014 0.0004 -0.0005
hfenergy: -939.1168822 hartree
pointgroup: C01 [X(C14H14S1)]
dipole: -0.0003328 -0.0000175 -0.5786102 debye
polarizability: 256.2074666|0.0061069|155.7502764|0.00557|-0.0020804|103.7930769 unknown
InChI: InChI=1S/C14H14S/c1-3-7-13(8-4-1)11-15-12-14-9-5-2-6-10-14/h1-10H,11-12H2
charge 0 multiplicity 1
29 atoms
S  -0.000499 0.000022 0.047056
C  -1.441237 -0.000018 -1.219311
C  1.440178 -0.000009 -1.218754
C  -2.765349 0.000031 -0.494023
C  2.764228 -0.000055 -0.493724
C  -3.39697 1.22139 -0.142485
C  3.396087 -1.221354 -0.142082
C  -3.397229 -1.22128 -0.142787
C  3.39641 1.221202 -0.142523
C  -4.634669 1.222945 0.53817
C  4.633839 -1.222936 0.538376
C  -4.634928 -1.222742 0.537868
C  4.634166 1.222699 0.537934
C  -5.258258 0.000123 0.879732
C  5.257554 -0.000138 0.879808
H  -1.319955 -0.900749 -1.845315
H  -1.319925 0.900659 -1.845387
H  1.319128 0.900569 -1.845088
H  1.31906 -0.90058 -1.845088
H  -2.913324 2.17091 -0.402033
H  2.912348 -2.170895 -0.401522
H  -2.913784 -2.170837 -0.402578
H  2.912929 2.17078 -0.402307
H  -5.111701 2.173854 0.800976
H  5.110802 -2.173889 0.80113
H  -5.112159 -2.173616 0.800439
H  5.111382 2.173622 0.80034
H  -6.219098 0.000165 1.406576
H  6.218475 -0.000173 1.406505
