program: Gaussian 09
title: 000099769
version: EM64L-G09RevD.01
frameworkgroup: C1[X(C7H15Cl2N2O4P)]
method: RPBEPBE
basis: SDD
operation: Freq
keyword: #p
keyword: freq=noraman
keyword: PBEPBE/SDD
title: #p freq=noraman PBEPBE/SDD
converged: YES YES NO NO
title: Mulliken charges:
elementType: Cl Cl P O O O O N N C C C C C C C H H H H H H H H H H H H H H H
charge: -0.059876 -0.068996 1.406000 -0.451214 -0.232728 -0.601100 -0.365152 -0.521323 -0.748080 -0.058056 -0.366970 -0.327889 -0.310416 -0.294962 -0.553124 -0.535927 0.255051 0.235429 0.243900 0.233512 0.244531 0.246824 0.260108 0.380008 0.242406 0.258863 0.257440 0.312091 0.254258 0.298422 0.366971
chargesum: 0.00000
title: Mulliken charges with hydrogens summed into heavy atoms:
elementType: Cl Cl P O O O O N N C C C C C C C
charge: -0.059876 -0.068996 1.406000 -0.451214 -0.232728 -0.601100 0.001820 -0.521323 -0.368071 0.196995 0.112359 0.150154 0.196516 0.206306 0.016407 0.016753
polarizability: 1.62617196e+02 8.85643481e+00 1.62783810e+02 -5.13103345e+00 -4.05557728e+00 1.21059876e+02
1716.lowfreq: -6.9156 -2.0819 0.0016 0.0027 0.0031 3.2114 14.4021 20.4959 34.3923
frequency: 13.7602 20.2675 34.3328 49.3714 57.3512 74.2815 79.3505 83.8164 138.5098 157.7240 185.4812 197.2465 203.8792 209.9964 235.7543 240.0741 253.5121 283.6429 292.3412 327.6623 351.0355 395.0532 425.9946 443.9554 480.3391 490.2759 527.2236 603.2573 640.2889 663.5836 684.1464 695.9283 751.5984 761.0913 779.5516 795.4517 817.3022 836.7832 915.4898 931.5045 1009.6962 1015.7379 1038.4464 1046.0368 1049.4323 1058.0723 1076.1257 1098.7409 1108.0103 1152.6683 1168.0845 1193.0831 1220.9216 1230.8994 1247.9764 1256.8339 1264.0474 1270.6168 1288.8476 1311.0707 1340.1667 1354.9308 1356.1219 1356.7012 1369.6645 1387.4373 1434.1679 1454.5394 1457.6438 1467.3974 1468.5571 1473.0847 3005.7157 3009.8205 3013.3489 3018.4676 3023.9011 3059.9291 3062.1979 3076.4698 3080.3864 3083.1472 3104.6844 3152.1982 3153.5410 3479.8825 3513.6505
redmass: 12.6864 4.4123 6.0010 5.4954 3.3083 4.6510 5.0481 3.1288 4.3597 5.3093 5.7354 5.3667 5.6880 3.4885 2.3483 3.4237 2.4782 3.4963 3.3780 6.3901 4.4353 4.5434 5.5223 2.7052 4.4084 2.0061 2.6146 5.4998 3.0342 6.8705 5.7966 5.4687 2.6435 3.6023 1.5166 1.5324 4.6829 3.0428 3.6088 2.3141 1.6478 1.4686 3.8276 1.8751 3.5671 5.5199 2.1852 3.9916 3.9032 1.5043 1.3453 1.1212 1.1907 1.4606 1.2520 1.1636 1.2679 1.2007 1.1297 1.4310 1.4654 1.2667 1.3681 1.2823 1.4133 1.2457 1.0859 1.0814 1.0842 1.0811 1.0821 1.0838 1.0660 1.0725 1.0630 1.0602 1.0723 1.0565 1.0565 1.1045 1.1057 1.1010 1.1024 1.1129 1.1128 1.0685 1.0780
irintensity: 0.0797 0.6549 1.4979 0.9136 1.9363 0.7414 2.1037 4.8456 1.5876 6.4999 8.6049 1.3990 2.0461 12.8364 49.7341 59.2440 16.9017 22.4598 8.2093 25.2461 10.4063 16.9985 37.6624 29.3885 10.6865 38.6138 54.1327 37.8458 27.7039 45.5779 66.6800 97.4890 151.4651 15.3597 20.1705 15.2069 64.6337 58.2881 37.5994 40.8858 50.6289 0.5961 52.0144 32.5216 4.4780 105.3311 18.8408 69.9328 73.1648 58.0519 20.6598 0.5105 89.6520 38.3233 11.1958 8.7419 13.2395 17.5401 11.8322 51.7638 15.4004 4.9645 3.3113 6.7350 14.6485 82.1882 15.0911 3.1183 9.5729 18.0432 7.1945 19.1918 32.4786 4.1249 12.7014 16.0018 33.3471 15.9764 13.1982 8.0370 5.8649 8.2071 14.6614 9.1453 6.5638 22.4917 52.9655
temp: 298.150 k
press: 1.00000 atm
elementType: 17 17 15 8 8 8 8 7 7 6 6 6 6 6 6 6 1 1 1 1 1 1 1 1 1 1 1 1 1 1 1
symmnumber: 1
zpe: 616024.8 jmol-1
zpe.correction: 0.234631 hartree
zpe.thermalcorrener: 0.254085 hartree
zpe.thermalcorrenthalpy: 0.255029 hartree
zpe.thermalcorrgfe: 0.182789 hartree
zpe.sumelectzpe: -1946.096290 hartree
zpe.sumelectthermal: -1946.076837 hartree
zpe.sumelectthermalent: -1946.075893 hartree
zpe.sumelectthermalfe: -1946.148132 hartree
dipole: -4.5631 -4.7633 3.9230
dipole: 7.6747
quadrupole: -124.4699 -124.7829 -118.0093
quadrupole: 4.6765 0.5617 1.1389
quadrupole: -2.0492 -2.3622 4.4114 4.6765 0.5617 1.1389
hfenergy: -1946.3309213 hartree
pointgroup: C01 [X(C7H15Cl2N2O4P1)]
dipole: 1.4583827 2.1656969 1.5165758 debye
polarizability: 159.6615709|8.3556435|165.8825867|3.7533491|4.654314|120.9167251 unknown
InChI: InChI=1S/C7H15Cl2N2O4P/c8-2-4-10-16(13)11(5-3-9)7(15-12)1-6-14-16/h7,10,12H,1-6H2
charge 0 multiplicity 1
31 atoms
Cl 3.242901 -3.548206 0.363486
Cl -5.059106 -2.061382 0.637724
P  -0.402678 -0.103345 -0.879299
O  -0.326274 1.321037 -1.881538
O  0.865862 1.595925 1.629315
O  -0.624949 -1.420096 -1.736224
O  1.363615 2.94148 2.19459
N  1.140992 -0.00096 -0.014978
N  -1.554527 0.132465 0.383777
C  1.687596 1.271645 0.377706
C  1.5522 2.399475 -0.657881
C  0.11965 2.563405 -1.183745
C  1.673008 -1.253314 0.578583
C  -2.979044 -0.22826 0.254179
C  2.510819 -2.014261 -0.461029
C  -3.209381 -1.67665 0.717481
H  2.73901 1.156075 0.702176
H  2.234643 2.18209 -1.49989
H  1.876361 3.339863 -0.177323
H  -0.58331 2.803606 -0.362586
H  0.057942 3.342641 -1.958876
H  2.284196 -0.996056 1.461424
H  0.846389 -1.898845 0.928069
H  -1.218668 0.60361 1.229745
H  -3.584921 0.470221 0.858279
H  -3.30582 -0.12404 -0.79568
H  3.36674 -1.425207 -0.822221
H  1.892698 -2.373121 -1.296592
H  -2.913316 -1.832287 1.765658
H  -2.712942 -2.396779 0.050905
H  1.689115 2.638272 3.089764
