program: Gaussian 09
title: 000099734
version: EM64L-G09RevD.01
frameworkgroup: C1[X(C7H9Cl3O2)]
method: RPBEPBE
basis: SDD
operation: Freq
keyword: #p
keyword: freq=noraman
keyword: PBEPBE/SDD
title: #p freq=noraman PBEPBE/SDD
converged: YES YES NO NO
title: Mulliken charges:
elementType: Cl Cl Cl O O C C C C C C C H H H H H H H H H
charge: 0.116147 0.096230 0.116363 -0.256127 -0.374227 0.219920 0.109684 -0.694327 -0.735747 -0.668701 0.246112 -0.515516 0.262998 0.229348 0.247814 0.213845 0.229285 0.263980 0.239215 0.368571 0.285132
chargesum: 0.00000
title: Mulliken charges with hydrogens summed into heavy atoms:
elementType: Cl Cl Cl O O C C C C C C C
charge: 0.116147 0.096230 0.116363 -0.256127 -0.005656 0.219920 0.372682 -0.003320 -0.003267 -0.668701 0.246112 -0.230384
polarizability: 1.14522101e+02 8.00053026e+00 1.18323393e+02 9.71561563e+00 5.12729832e+00 9.50646616e+01
1716.lowfreq: 0.0017 0.0018 0.0019 4.0791 7.7108 10.0969 31.9098 45.3363 87.1098
frequency: 31.5552 45.3137 87.1036 112.5268 147.2301 165.1027 181.6740 194.2281 206.5380 218.7476 248.0682 268.0734 282.6164 295.4408 349.4600 357.6518 378.7255 395.1421 404.1837 521.1144 538.0627 564.2702 625.4382 634.7334 664.6549 672.1506 747.1675 764.0719 822.8101 930.0440 933.1602 950.6090 989.2035 1010.6881 1049.9804 1137.2761 1201.3345 1225.1143 1248.1798 1302.4213 1377.9152 1380.8245 1395.1999 1452.6576 1463.5735 1473.5269 1488.5437 2131.1172 2994.3108 3003.6302 3049.2011 3095.3647 3104.6044 3109.1268 3117.1686 3425.4465 3520.3596
redmass: 5.3403 7.0961 7.3574 6.1982 4.8885 3.0871 7.4788 6.7786 1.1757 4.2519 8.7179 2.1094 2.1861 3.0778 7.4320 2.7268 2.4660 3.6527 2.1492 4.6875 5.2857 5.6987 3.7923 1.3236 4.9759 1.3403 6.2766 5.1508 5.0825 1.5963 2.2353 3.5641 4.8616 1.5458 5.7101 1.8948 3.9870 2.7100 1.3408 1.2525 1.1996 1.1356 1.2012 1.0496 1.0488 1.0490 1.0501 6.0294 1.0353 1.0348 1.0845 1.0999 1.1011 1.1007 1.1008 1.1593 1.0647
irintensity: 0.1726 0.2773 0.0798 0.3970 0.0993 1.2855 2.0017 1.0426 0.3727 1.4064 3.7364 0.3022 0.3758 2.8067 7.5748 1.9145 84.0503 1.8185 115.5881 50.8143 10.7917 76.0372 39.8449 76.1671 46.1604 60.8485 107.8026 53.7526 101.0389 17.6352 10.5193 88.8504 175.9997 46.9062 62.8622 83.4031 14.9249 71.5197 24.2338 9.4986 29.5891 14.0603 22.1405 6.2699 2.2337 7.5681 17.6513 0.3968 8.9197 13.3531 19.4693 10.8563 12.1467 30.5799 16.4986 62.5482 14.6827
temp: 298.150 k
press: 1.00000 atm
elementType: 17 17 17 8 8 6 6 6 6 6 6 6 1 1 1 1 1 1 1 1 1
symmnumber: 1
zpe: 379721.3 jmol-1
zpe.correction: 0.144628 hartree
zpe.thermalcorrener: 0.159395 hartree
zpe.thermalcorrenthalpy: 0.160339 hartree
zpe.thermalcorrgfe: 0.102293 hartree
zpe.sumelectzpe: -1801.736127 hartree
zpe.sumelectthermal: -1801.721360 hartree
zpe.sumelectthermalent: -1801.720416 hartree
zpe.sumelectthermalfe: -1801.778462 hartree
dipole: -3.0124 0.3471 0.5444
dipole: 3.0808
quadrupole: -88.5313 -86.5216 -92.5369
quadrupole: 0.0471 0.1663 5.4473
quadrupole: 0.6653 2.6750 -3.3403 0.0471 0.1663 5.4473
hfenergy: -1801.8807554 hartree
pointgroup: C01 [X(C7H9Cl3O2)]
dipole: 1.1811429 0.1087034 -0.2494908 debye
dipolederiv: -0.1802968 0.1120922 0.0232747 0.0664833 -0.7730896 -0.109561 0.0297359 -0.1109236 -0.1564876 -0.1907536 0.0215357 0.0121502 0.0294028 -0.3306432 0.2934012 0.0209687 0.2651427 -0.586277 -0.5225776 -0.1501971 -0.3020002 -0.1602279 -0.1998018 -0.1246906 -0.2739029 -0.127249 -0.4000305 -1.4926984 -0.0939226 -0.1275644 -0.2249327 -0.5491558 0.0197343 -0.2100144 -0.0795314 -0.3925977 -0.8088966 0.1178966 0.0721239 -0.1038832 -0.7726202 -0.2087323 -0.0260326 -0.1391786 -0.2138041 1.1457186 -0.0950753 0.0468301 -0.0872807 0.5991449 -0.1180471 -0.1145798 -0.1132152 0.3903506 1.1917974 -0.0860352 -0.0284726 0.2070721 0.6755313 0.1587876 0.3422059 0.1530534 0.2920884 -0.0561833 0.0224593 -0.0246114 -0.0253732 -0.0602793 -0.0427889 -0.0416551 -0.0101942 -0.0372329 -0.1303698 0.0058791 0.0004711 0.0012395 -0.0424924 0.0492978 0.0845842 0.0172191 -0.1622616 0.7124643 0.0906704 0.3241361 0.0798704 1.2963087 -0.0592345 0.3222109 -0.0753747 1.1642189 -0.141871 -0.1093514 0.0350691 -0.016718 -0.0549275 -0.0122242 0.0540265 0.014435 -0.1266059 -0.3634008 0.0677275 -0.0271692 0.0996518 -0.4043199 0.0317777 -0.0464428 0.0298511 -0.3023725 0.0056796 -0.0051289 0.0392442 0.015347 -0.0083272 0.0238586 -0.0882467 0.0558058 -0.0583625 0.0773081 0.0857635 -0.0290308 0.0687642 -0.1099092 0.0284646 -0.0349606 0.0311284 0.0775408 0.115065 -0.0037117 0.040414 -0.0182088 0.0813618 0.0505475 0.0178084 0.0225248 -0.0928118 -0.1380348 -0.0248828 0.0223893 -0.0071747 0.0942895 -0.0196085 0.047195 -0.0025261 0.0872971 0.0678864 0.1091006 -0.0333341 0.1028961 -0.0775518 0.0457709 -0.0216162 0.0391401 0.0463829 0.0851853 -0.0456362 -0.0832888 -0.0629475 0.0098534 -0.0762653 -0.0619726 -0.0618892 0.0217826 -0.120805 -0.0288422 0.0595469 -0.0255587 0.1108576 0.0144828 0.040643 0.0029911 0.1054353 0.4832383 0.0029339 -0.0234438 0.0549722 0.2931286 0.0434847 -0.0410077 0.0799803 0.0812268 0.2615448 0.0067245 0.0032658 0.006606 0.2226418 0.0115448 0.0010529 0.0088101 0.2625207 unknown
polarizability: 114.6578823|-8.2697621|119.0248097|8.7301552|-4.5304106|94.2274643 unknown
InChI: InChI=1S/C7H9Cl3O2/c1-4-6(2,3)12-5(11)7(8,9)10/h1,5,11H,2-3H3
charge 0 multiplicity 1
21 atoms
Cl -2.398133 1.963994 0.539406
Cl -2.171928 -0.80602 1.77466
Cl -3.461769 -0.43627 -0.939834
O  0.243334 0.506257 0.382491
O  -0.505124 -1.415314 -0.873124
C  1.691044 0.499345 -0.069892
C  -0.734702 -0.038739 -0.524368
C  2.33096 1.566315 0.843131
C  1.824505 0.860934 -1.565985
C  -2.111764 0.166525 0.186419
C  2.277371 -0.834718 0.211694
C  2.806665 -1.915774 0.477731
H  -0.775791 0.490655 -1.493674
H  1.892957 2.553734 0.620139
H  2.136006 1.323201 1.900022
H  3.421688 1.603403 0.681087
H  1.337856 1.831957 -1.767377
H  1.388856 0.081938 -2.213453
H  2.894325 0.950887 -1.820863
H  -0.368723 -1.944496 -0.042058
H  3.26377 -2.863613 0.696649
