program: Gaussian 09
title: 000099749
version: EM64L-G09RevD.01
frameworkgroup: C1[X(C19H12N2O4)]
method: RPBEPBE
basis: SDD
operation: Freq
keyword: #p
keyword: freq=noraman
keyword: PBEPBE/SDD
title: #p freq=noraman PBEPBE/SDD
converged: YES YES NO NO
title: Mulliken charges:
elementType: O O O O N N C C C C C C C C C C C C C C C C C C C H H H H H H H H H H H H
charge: -0.203243 -0.180402 -0.428798 -0.192836 -0.407698 -0.453405 -0.096448 -0.610958 0.521575 0.288979 -0.129383 0.016516 0.211876 0.009210 0.219586 0.292100 -0.433866 -0.377118 0.045921 -0.381683 -0.182194 -0.354805 0.044835 -0.252395 -0.204575 0.286384 0.256119 0.321520 0.240155 0.252079 0.328452 0.241112 0.225453 0.238633 0.232856 0.230187 0.386257
chargesum: 0.00000
title: Mulliken charges with hydrogens summed into heavy atoms:
elementType: O O O O N N C C C C C C C C C C C C C C C C C C C
charge: -0.203243 -0.180402 -0.042541 -0.192836 -0.086177 -0.124953 -0.096448 -0.068455 0.521575 0.288979 -0.129383 0.016516 0.211876 0.009210 0.219586 0.292100 -0.193711 -0.125038 0.045921 -0.140571 0.043259 -0.116173 0.044835 -0.019539 0.025612
polarizability: 2.68485436e+02 2.24859842e+00 2.51958533e+02 1.21453019e+01 2.69539317e+00 1.86091359e+02
1716.lowfreq: -3.9940 -0.0005 -0.0002 0.0002 6.7739 6.9944 33.0772 37.4403 45.4597
frequency: 33.0358 37.4227 45.4574 57.0226 65.1431 121.7032 122.5791 144.9129 177.1851 196.2255 218.2958 227.4052 263.3692 278.4654 292.4686 309.5561 325.5620 343.3038 406.5967 429.5852 446.0772 476.5439 482.1918 518.0384 524.2757 536.5920 560.0807 566.0408 587.0624 590.2632 597.8767 601.1973 629.9510 634.0792 640.8535 651.1297 664.4579 703.8548 727.8590 729.1752 742.4535 758.9391 761.3340 781.6769 799.8275 821.7156 863.6792 866.3562 876.4087 890.0768 908.9802 940.4055 963.5926 970.7310 981.4602 986.1882 1017.7979 1023.6480 1036.6246 1052.9062 1060.4638 1101.1951 1134.6003 1157.1954 1163.6123 1174.1312 1183.6596 1209.8449 1233.0168 1235.8376 1246.7850 1264.9509 1283.4722 1291.0030 1297.3378 1328.7974 1339.2308 1340.4187 1412.8615 1414.5340 1440.6410 1453.0191 1460.6076 1472.4421 1485.2669 1606.4766 1619.1224 1623.8821 1627.7337 1630.8179 1643.3130 1658.5824 1668.8933 2959.8121 3075.9341 3132.8170 3134.8256 3143.0994 3151.6935 3153.4865 3166.6369 3169.9258 3523.3078 3575.2068 3594.3879
redmass: 6.5828 7.3450 11.6644 4.9407 5.2614 9.8002 7.2561 7.5033 4.0173 6.6764 8.8658 4.3340 3.8259 7.3176 6.8555 3.8701 5.2159 5.8739 4.8258 5.0274 3.9574 8.3144 5.2501 5.1461 4.4525 3.0220 4.6688 3.2637 1.5661 2.4112 1.6357 3.3594 3.6452 3.4949 2.2878 4.6757 6.2572 5.5410 5.6662 4.6291 3.4021 1.7958 2.1777 2.1770 4.9160 3.1955 2.1301 2.4714 5.7688 1.4670 4.6181 1.4139 7.3756 1.3566 1.3222 3.2608 4.9617 2.1480 3.4383 4.1868 2.2572 2.2152 2.5600 2.3106 1.9492 1.1636 1.5060 2.4009 1.7926 1.6986 2.1569 2.2284 2.1611 2.7667 2.5079 1.6794 2.5378 2.0830 3.5745 3.6119 1.0970 4.0245 2.8860 2.9628 3.0556 6.8048 7.4645 8.3637 7.9606 8.3518 10.1742 9.8379 9.8463 1.0684 1.0913 1.0858 1.0866 1.0898 1.0927 1.0953 1.0984 1.1003 1.0641 1.0795 1.0800
irintensity: 1.6299 0.8244 0.6343 0.8652 1.6236 1.2759 0.4711 1.5344 2.0135 2.4554 1.1496 2.6747 2.6763 5.7275 0.4148 1.7128 2.2202 2.0439 1.8664 5.5578 13.6173 1.7357 5.4202 2.0915 1.2163 16.0162 53.4560 23.3463 142.8144 41.1630 35.1258 17.1056 38.1160 15.4982 26.0239 16.4815 10.8804 33.3800 2.2589 1.4174 17.4879 58.1525 39.2732 49.7126 12.7192 5.1009 8.5165 0.4872 28.4566 3.0534 7.0818 1.8684 21.1713 1.4026 0.1781 6.2516 39.8200 17.6568 337.8738 33.4514 23.7791 31.7885 17.6774 95.3390 88.4611 7.0871 21.3293 130.0242 1.9044 7.4596 16.1200 12.7378 21.8260 96.2061 24.7951 8.5291 24.4094 24.4838 9.8389 7.7292 13.3791 67.3901 40.7504 61.5041 2.4324 4.5075 239.4746 73.0912 100.0602 40.4795 67.9985 265.1761 365.2045 6.2214 6.7919 2.0027 2.6755 5.4440 10.7924 22.5957 20.6606 19.0073 56.0663 49.2974 61.1608
temp: 298.150 k
press: 1.00000 atm
elementType: 8 8 8 8 7 7 6 6 6 6 6 6 6 6 6 6 6 6 6 6 6 6 6 6 6 1 1 1 1 1 1 1 1 1 1 1 1
symmnumber: 1
zpe: 706111.2 jmol-1
zpe.correction: 0.268944 hartree
zpe.thermalcorrener: 0.288202 hartree
zpe.thermalcorrenthalpy: 0.289146 hartree
zpe.thermalcorrgfe: 0.220751 hartree
zpe.sumelectzpe: -1139.965902 hartree
zpe.sumelectthermal: -1139.946643 hartree
zpe.sumelectthermalent: -1139.945699 hartree
zpe.sumelectthermalfe: -1140.014095 hartree
dipole: 4.7324 2.4302 -1.5760
dipole: 5.5485
quadrupole: -133.8055 -126.8535 -150.6386
quadrupole: -16.2651 -5.1069 -10.3900
quadrupole: 3.2937 10.2457 -13.5394 -16.2651 -5.1069 -10.3900
hfenergy: -1140.2348453 hartree
pointgroup: C01 [X(C19H12N2O4)]
dipole: 1.8783517 0.9878469 -0.5110184 debye
polarizability: 267.1706499|1.8912555|251.8203796|15.8512869|4.5266418|187.5442976 unknown
InChI: InChI=1S/C19H12N2O4/c22-16-14-9(17(23)24)8-19(11-5-3-7-13(20-16)15(11)14)10-4-1-2-6-12(10)21-18(19)25/h1-7,20-21,23H,8H2
charge 0 multiplicity 1
37 atoms
O  1.599821 0.540982 3.149514
O  -4.242135 -0.70327 -1.006968
O  -1.414291 -3.575564 1.292415
O  -2.584722 -3.182298 -0.680293
N  3.184222 0.082748 1.454191
N  -3.297817 1.467104 -0.883418
C  0.894525 0.017358 0.77801
C  -0.028853 -1.180514 1.204231
C  0.063132 1.268188 0.458135
C  1.839405 -0.323842 -0.381414
C  -1.242585 1.037891 0.007277
C  1.891543 0.263383 1.96052
C  -1.304961 -1.373488 0.382481
C  -1.907673 -0.246587 -0.128188
C  3.182271 -0.272476 0.080343
C  -2.094646 2.072858 -0.457688
C  0.518611 2.608392 0.475721
C  1.574265 -0.647985 -1.720842
C  -3.27729 0.048228 -0.730946
C  -1.656305 3.407536 -0.446363
C  -0.34061 3.649546 0.040006
C  4.275266 -0.545669 -0.760325
C  -1.858611 -2.745796 0.239601
C  2.66298 -0.931483 -2.586921
C  3.993866 -0.879993 -2.109145
H  -0.33534 -0.998407 2.257353
H  0.564313 -2.109705 1.212502
H  4.015294 0.164098 2.040417
H  1.526991 2.850088 0.82727
H  0.546024 -0.681937 -2.096222
H  -4.114555 1.949475 -1.256339
H  -2.283931 4.234909 -0.791501
H  0.023251 4.682734 0.070422
H  5.307442 -0.504752 -0.396301
H  2.471316 -1.190977 -3.633157
H  4.823131 -1.100219 -2.790346
H  -1.793644 -4.485956 1.159068
