program: Gaussian 09
title: 000099729
version: EM64L-G09RevD.01
frameworkgroup: C1[X(C7H14N2O3S2)]
method: RPBEPBE
basis: SDD
operation: Freq
keyword: #p
keyword: freq=noraman
keyword: PBEPBE/SDD
title: #p freq=noraman PBEPBE/SDD
converged: NO YES NO NO
title: Mulliken charges:
elementType: S S O O O N N C C C C C C C H H H H H H H H H H H H H H
charge: 0.118559 0.964272 -0.556829 -0.476280 -0.552062 -0.080054 -0.634985 -0.192323 -0.440435 -0.449278 -0.438250 -0.422491 0.316200 -0.862039 0.215935 0.190916 0.235641 0.234692 0.212604 0.223190 0.228073 0.216222 0.211936 0.308071 0.326501 0.338872 0.382459 0.380883
chargesum: 0.00000
title: Mulliken charges with hydrogens summed into heavy atoms:
elementType: S S O O O N N C C C C C C C
charge: 0.118559 0.964272 -0.175946 -0.476280 -0.552062 -0.080054 0.086346 0.023612 -0.013878 -0.001982 0.013013 0.005667 0.316200 -0.227467
polarizability: 3.39852108e+02 7.57950516e-01 1.31786211e+02 -2.08328981e+01 -3.30164501e+00 1.22214225e+02
1716.lowfreq: -7.4045 0.0017 0.0024 0.0024 3.8343 9.7653 15.2971 22.4834 32.5664
frequency: 13.8531 22.0313 31.7987 64.9334 71.5177 100.4074 110.7581 123.1279 145.3927 166.6303 176.4692 203.6552 233.1464 252.4541 281.5129 295.6574 316.0604 391.3025 400.9123 417.6595 498.8932 516.1875 559.2609 574.0818 615.4838 688.7706 714.3476 753.8218 763.6360 801.6142 812.8382 843.3077 867.8083 873.6354 900.1733 911.9944 933.9526 940.9284 978.4628 1019.1734 1039.4392 1058.2938 1075.9492 1101.1513 1144.0839 1158.6146 1175.0282 1189.5524 1211.3569 1238.2681 1255.4365 1272.3945 1297.0743 1303.4074 1310.3740 1342.2318 1363.3006 1400.5459 1452.5332 1459.5300 1461.7581 1480.6688 1583.2083 1645.6613 2915.5807 2991.4518 2995.9962 3004.7782 3010.8060 3017.8267 3050.8057 3068.1891 3076.4897 3086.7254 3095.9011 3316.4999 3453.0192 3622.2449
redmass: 4.6510 3.8853 4.2737 3.8803 3.8050 4.9930 2.6412 6.9448 7.8478 1.8864 2.7780 4.2927 3.4099 5.7610 5.8181 9.0217 3.1786 3.4148 7.6417 2.1977 1.3326 14.7861 2.3046 2.4921 4.8951 3.3788 4.6222 1.2126 1.7148 2.0170 8.1435 2.1454 2.1035 3.1120 2.4989 2.3311 14.5294 1.7708 2.0654 1.5008 1.1518 2.4126 1.6466 1.2732 1.3726 1.5845 1.5533 1.2796 1.3280 1.2140 1.2014 1.3327 1.3417 1.3891 1.3886 1.4770 2.6502 1.2151 1.0898 1.0815 1.0877 1.0988 5.9387 1.1652 1.0829 1.0606 1.0643 1.0596 1.0661 1.0585 1.1008 1.1029 1.1007 1.1046 1.1036 1.0635 1.0660 1.0886
irintensity: 1.5203 1.1579 0.2262 0.2914 1.1734 1.8806 16.9336 3.2349 19.8576 61.3295 38.3839 10.5749 5.3986 4.1635 28.1303 17.8279 1.6595 28.0547 20.0568 0.9105 44.8359 233.1995 26.5658 46.2373 23.6811 2.4275 8.7052 169.1896 24.6116 0.3317 68.8376 24.1366 7.4623 11.6211 1.9660 7.5828 77.1006 6.2166 7.5393 12.0361 56.7841 7.5100 29.8235 14.1210 12.2038 1.3329 8.9443 4.6119 15.9497 9.5720 3.1958 13.9566 6.4718 1.3757 5.5698 62.3104 11.4118 40.7956 16.8479 3.0132 14.8406 6.0274 40.2706 143.8940 55.2226 29.8257 61.3753 62.1090 35.2668 5.8626 18.8259 18.0752 28.9910 85.1749 12.2674 4.7992 80.5370 52.0181
temp: 298.150 k
press: 1.00000 atm
elementType: 16 16 8 8 8 7 7 6 6 6 6 6 6 6 1 1 1 1 1 1 1 1 1 1 1 1 1 1
symmnumber: 1
zpe: 562925.7 jmol-1
zpe.correction: 0.214407 hartree
zpe.thermalcorrener: 0.231559 hartree
zpe.thermalcorrenthalpy: 0.232503 hartree
zpe.thermalcorrgfe: 0.166153 hartree
zpe.sumelectzpe: -1405.142698 hartree
zpe.sumelectthermal: -1405.125546 hartree
zpe.sumelectthermalent: -1405.124602 hartree
zpe.sumelectthermalfe: -1405.190952 hartree
dipole: 2.2737 1.3365 -2.0359
dipole: 3.3318
quadrupole: -97.1656 -100.6275 -101.9131
quadrupole: 5.9787 9.8824 -0.9832
quadrupole: 2.7365 -0.7255 -2.0110 5.9787 9.8824 -0.9832
hfenergy: -1405.3571051 hartree
pointgroup: C01 [X(C7H14N2O3S2)]
dipole: -0.8987006 0.8082234 0.5073807 debye
polarizability: 335.2760536|0.3369569|131.5829662|-37.5217653|-3.6667658|126.9935241 unknown
InChI: InChI=1S/C7H13N2S.HO3S/c8-7(5-10)9-6-3-1-2-4-6;1-4(2)3/h6H,1-5,8H2;1H
charge 0 multiplicity 1
28 atoms
S  1.834405 -1.496354 -0.415732
S  3.586502 0.19221 -0.921691
O  4.680846 -0.20463 0.536359
O  4.419174 0.018009 -2.292779
O  2.93083 1.655491 -0.604549
N  -1.387023 -0.241103 0.713015
N  0.092637 1.437013 -0.231121
C  -2.605281 0.507845 0.317287
C  -3.813836 -0.061332 1.101259
C  -2.964379 0.229033 -1.195722
C  -4.205255 -1.318015 0.291089
C  -4.107613 -0.839059 -1.183382
C  -0.197714 0.270576 0.455821
C  1.000502 -0.502407 0.957902
H  -2.487379 1.600243 0.502041
H  -4.641612 0.675087 1.088485
H  -3.548626 -0.275579 2.150191
H  -2.074889 -0.136545 -1.739019
H  -3.29636 1.162198 -1.68834
H  -5.205127 -1.708424 0.550485
H  -3.462006 -2.113853 0.481513
H  -3.903916 -1.67129 -1.879544
H  -5.063374 -0.375799 -1.493082
H  1.768631 0.147416 1.413664
H  0.67134 -1.248919 1.70057
H  -0.650601 1.973954 -0.674586
H  1.074104 1.713911 -0.390863
H  5.446617 0.444225 0.534628
