program: Gaussian 09
title: 000099703
version: EM64L-G09RevD.01
frameworkgroup: C1[X(C17H20O5)]
method: RPBEPBE
basis: SDD
operation: Freq
keyword: #pfreq=noraman
keyword: PBEPBE/SDD
title: #p freq=noraman PBEPBE/SDD
converged: YES YES NO NO
title: Mulliken charges:
elementType: O O O O O C C C C C C C C C C C C C C C C C H H H H H H H H H H H H H H H H H H H H
charge: -0.205659 -0.202025 -0.217400 -0.247015 -0.217824 -0.267402 0.175637 0.186060 -0.177284 -0.533882 -0.517904 -0.411085 0.463971 0.152394 -0.746073 -0.777146 -0.368807 0.348188 -0.552222 -0.286693 0.190863 -0.504510 0.245637 0.252681 0.216897 0.219149 0.246159 0.235395 0.218047 0.232146 0.239330 0.235197 0.215507 0.229698 0.250519 0.225241 0.253926 0.265047 0.238477 0.253223 0.207752 0.235787
chargesum: 0.00000
title: Mulliken charges with hydrogens summed into heavy atoms:
elementType: O O O O O C C C C C C C C C C C C C C C C C
charge: -0.205659 -0.202025 -0.217400 -0.247015 -0.217824 -0.021765 0.175637 0.186060 0.075397 -0.097836 -0.036350 0.039108 0.463971 0.152394 -0.056038 -0.071688 -0.114881 0.348188 -0.287175 -0.048216 0.190863 0.192252
polarizability: 2.27494711e+02 1.69492540e+01 1.95184872e+02 -3.93006863e+00 -8.16740800e+00 1.55490058e+02
1716.lowfreq: -4.8691 0.0004 0.0007 0.0010 2.7871 10.7109 30.0385 49.7838 71.2323
frequency: 29.6765 49.7737 71.2219 88.3422 107.3607 115.2306 155.6284 170.2394 177.3453 195.4101 201.5418 216.9149 230.6393 241.3774 248.9454 256.3292 271.9984 294.9283 308.8815 320.9989 342.5883 356.1190 397.2532 434.3197 455.9822 468.0069 493.6601 506.8478 542.0336 558.5113 578.3664 594.1820 663.0040 676.1718 688.1886 693.7406 705.4193 730.3056 763.1889 772.4951 810.2819 833.3908 841.6944 848.4857 868.8366 886.6017 893.2897 903.9572 912.6941 922.0325 924.7308 967.7764 977.5785 989.8974 1001.4712 1014.0252 1026.3190 1035.6776 1059.2220 1091.2831 1099.6021 1112.7648 1129.0733 1136.3008 1146.2539 1156.7901 1170.4951 1178.1383 1202.8911 1215.0209 1230.2324 1250.3591 1260.7175 1267.9744 1282.0463 1296.9266 1314.8249 1317.3176 1330.6410 1335.9884 1342.4063 1344.6017 1350.6604 1390.2448 1392.8290 1416.1215 1429.7647 1454.8706 1465.5255 1467.2428 1470.4785 1477.3614 1478.5818 1481.1142 1486.2701 1504.5437 1594.4688 1644.2616 1667.0582 1692.2400 2965.2799 2976.7227 2987.6105 2987.8155 2996.2858 2999.6749 3003.1383 3004.2580 3028.0537 3033.9986 3051.9352 3065.6326 3070.3241 3073.8737 3082.3640 3085.3161 3098.1022 3129.7731 3129.8775 3176.9175
redmass: 5.6459 6.8981 3.8656 5.4427 5.4243 1.7519 3.7339 3.2970 2.2701 2.8934 1.9112 1.1797 1.4473 3.0546 3.1139 2.6269 3.1549 2.9674 3.1845 3.6384 4.2380 3.4104 4.7478 4.3565 7.0148 4.3194 4.4777 4.6553 4.5833 4.3470 5.0657 5.3581 6.4768 4.5875 5.2932 4.4449 5.1849 2.9602 3.1744 4.3037 2.1770 3.3144 3.1994 2.6959 3.8444 3.0813 2.5914 1.7872 2.7905 3.8075 2.2592 2.6762 1.6740 2.2711 1.8600 2.1517 3.7517 2.9802 3.5935 1.8430 2.1977 1.2619 2.7031 1.9265 1.4219 2.9026 2.6441 2.6738 1.6896 2.3477 1.5791 1.7731 1.3155 1.3819 1.4744 1.4512 1.3710 1.1854 1.5088 1.4293 1.5046 1.3924 1.5493 1.2176 1.1923 2.8798 1.1424 1.0504 1.0622 1.0566 1.0568 1.0656 1.0540 1.0608 1.0787 1.0817 9.2879 9.3902 8.5347 12.4035 1.0358 1.0358 1.0533 1.0449 1.0615 1.0822 1.0863 1.0661 1.0857 1.0982 1.0998 1.1030 1.0980 1.0998 1.0990 1.0998 1.0998 1.0919 1.1026 1.0911
irintensity: 3.6449 1.2458 2.1392 3.3640 1.3630 2.1102 1.2628 4.4817 1.1979 3.0741 1.0769 0.0446 0.1433 4.9937 1.5065 1.1787 1.9260 5.3094 3.2727 1.5639 1.6840 0.3780 0.8176 1.6544 10.6203 3.0343 6.8743 5.0775 1.5813 1.3759 3.8697 1.5563 11.0647 6.4343 2.1954 7.1313 5.0591 0.7592 1.3433 24.1545 4.6661 32.5286 15.9482 99.8093 25.8758 46.1725 73.3489 20.3987 53.5243 68.3458 38.3648 25.0485 7.3189 6.8451 31.5645 12.7495 192.7063 10.0841 6.4249 18.4133 19.9634 0.5720 7.5861 14.3170 10.2650 85.4031 18.0785 12.4820 37.3676 7.4629 1.4499 18.5770 2.0696 6.9128 5.7615 7.8399 5.9243 2.5009 14.8691 4.7030 13.0615 2.5199 22.2759 10.6668 24.0178 9.8276 3.3662 11.6295 7.5793 6.4028 14.0672 7.3716 12.3885 8.7776 4.6456 29.7492 10.9745 420.1995 2.7413 292.6267 68.8845 16.5282 12.3474 31.8021 24.4294 19.2061 33.2894 24.4771 23.4097 14.5567 15.1977 47.5654 28.1817 32.6635 19.4178 22.2738 15.2885 5.6857 17.1730 3.1740
temp: 298.150 k
press: 1.00000 atm
elementType: 8 8 8 8 8 6 6 6 6 6 6 6 6 6 6 6 6 6 6 6 6 6 1 1 1 1 1 1 1 1 1 1 1 1 1 1 1 1 1 1 1 1
symmnumber: 1
zpe: 890705.7 jmol-1
zpe.correction: 0.339252 hartree
zpe.thermalcorrener: 0.359197 hartree
zpe.thermalcorrenthalpy: 0.360142 hartree
zpe.thermalcorrgfe: 0.291976 hartree
zpe.sumelectzpe: -1034.260908 hartree
zpe.sumelectthermal: -1034.240963 hartree
zpe.sumelectthermalent: -1034.240019 hartree
zpe.sumelectthermalfe: -1034.308184 hartree
dipole: -0.7208 -0.0927 5.5330
dipole: 5.5805
quadrupole: -141.0536 -132.4036 -136.3006
quadrupole: -27.3331 -3.9759 0.0914
quadrupole: -4.4676 4.1823 0.2853 -27.3331 -3.9759 0.0914
hfenergy: -1034.6001602 hartree
pointgroup: C01 [X(C17H20O5)]
dipole: 0.2790871 0.0820146 2.1761937 debye
polarizability: 227.9471869|16.5599674|195.0639954|3.8352968|7.2484708|155.1584591 unknown
InChI: InChI=1S/C17H20O5/c1-16-5-4-6-17(2)13(16)11(21-15(17)19)7-9-10(16)8-12(18)22-14(9)20-3/h7-8,11,13-14H,4-6H2,1-3H3
charge 0 multiplicity 1
42 atoms
O  2.117692 2.267204 -0.277661
O  3.611963 1.447315 -1.844766
O  -3.021729 -0.049791 -1.273376
O  -3.311522 1.253605 0.73105
O  -3.415039 -2.311065 -1.357637
C  1.658215 0.239821 1.030794
C  0.511888 -0.807182 1.285636
C  2.626174 -0.110246 -0.154315
C  1.178217 1.698461 0.758458
C  1.136375 -2.214567 1.069224
C  1.981499 -1.138564 -1.125255
C  1.617511 -2.457576 -0.391507
C  -0.720398 -0.573068 0.399895
C  2.860389 1.226862 -0.882536
C  0.025499 -0.668527 2.762884
C  4.015629 -0.609415 0.32987
C  -0.216738 1.84983 0.218684
C  -1.07733 0.807269 0.051052
C  -1.555051 -1.586344 -0.005376
C  -2.487785 1.061353 -0.44004
C  -2.722739 -1.384968 -0.882145
C  -4.696644 1.657656 0.409898
H  2.262514 0.256279 1.957464
H  1.3138 2.350842 1.639401
H  0.427095 -3.005092 1.377768
H  1.991072 -2.295514 1.76962
H  2.675369 -1.336597 -1.962014
H  1.069844 -0.698314 -1.571606
H  2.487879 -3.139508 -0.374788
H  0.831665 -2.972055 -0.973913
H  -0.386258 0.336547 2.96502
H  -0.767103 -1.405284 2.982233
H  0.867604 -0.848057 3.457214
H  3.932843 -1.580643 0.846454
H  4.692853 -0.727115 -0.533956
H  4.47854 0.111354 1.028559
H  -0.519038 2.869871 -0.049336
H  -1.37124 -2.631052 0.257001
H  -2.553656 1.932258 -1.122449
H  -5.21624 0.864599 -0.155266
H  -4.703451 2.597924 -0.177764
H  -5.185967 1.819295 1.381624
