program: Gaussian 09
title: 000099655
version: EM64L-G09RevD.01
frameworkgroup: C1[X(C14H20Cl4N2)]
method: RPBEPBE
basis: SDD
operation: Freq
keyword: #p
keyword: freq=noraman
keyword: PBEPBE/SDD
title: #p freq=noraman PBEPBE/SDD
converged: YES YES NO NO
title: Mulliken charges:
elementType: Cl Cl Cl Cl N N C C C C C C C C C C C C C C H H H H H H H H H H H H H H H H H H H H
charge: -0.066262 -0.066262 -0.069078 -0.069072 -0.178105 -0.138773 0.473513 0.476606 -0.386528 -0.386535 -0.416874 -0.416870 -0.399039 -0.396792 -0.399079 -0.396756 -0.584464 -0.584468 -0.554654 -0.554673 0.245273 0.246251 0.245270 0.246253 0.231793 0.274092 0.231791 0.274085 0.228930 0.220891 0.228930 0.220892 0.292454 0.267579 0.292460 0.267581 0.261265 0.288552 0.261265 0.288558
chargesum: 0.00000
title: Mulliken charges with hydrogens summed into heavy atoms:
elementType: Cl Cl Cl Cl N N C C C C C C C C C C C C C C
charge: -0.066262 -0.066262 -0.069078 -0.069072 -0.178105 -0.138773 0.473513 0.476606 0.104996 0.104988 0.089011 0.089006 -0.170109 -0.175901 -0.170150 -0.175864 -0.024431 -0.024427 -0.004837 -0.004850
polarizability: 2.94865987e+02 1.26916843e-03 2.19121087e+02 5.19715237e-04 -1.52266571e+00 1.39668427e+02
1716.lowfreq: -5.9350 -4.2204 -0.0027 0.0013 0.0014 3.8194 16.3494 23.0974 31.6206
frequency: 15.6680 22.8016 31.6187 33.4092 38.9155 45.2503 69.9337 83.1404 89.6015 94.4800 116.2090 134.3672 140.1335 169.0978 185.7428 203.4913 221.4261 238.7147 248.0662 296.5982 340.8381 347.8216 380.6395 386.7700 415.0665 439.9314 460.0888 511.1330 516.4141 523.4100 550.1070 598.0767 603.2291 632.0836 639.3776 670.3153 685.7240 712.2765 758.2409 779.3993 786.1224 790.4388 800.1560 864.5454 869.2022 906.9270 921.4144 922.4575 942.8057 954.2633 985.7318 996.8445 1008.2185 1027.0564 1032.3013 1034.6484 1041.7452 1051.7170 1120.4225 1152.6604 1160.5470 1170.8468 1181.7516 1183.2841 1225.8699 1227.8866 1234.9827 1253.3845 1253.4384 1262.8742 1274.7283 1293.6369 1295.1290 1305.5508 1336.6656 1348.7746 1351.5452 1354.5130 1359.3911 1372.3271 1375.8906 1398.0466 1436.6046 1440.7509 1443.1073 1457.1167 1457.5473 1461.6172 1481.8911 1486.1181 1502.0376 1522.6560 1561.5447 1647.9681 2962.0564 2965.0806 3006.6889 3012.1142 3053.2354 3053.6100 3062.0013 3063.0331 3064.6349 3069.1833 3070.7748 3077.4814 3138.3681 3139.1727 3143.3800 3143.7778 3148.2660 3148.7121 3159.8652 3165.7033
redmass: 13.1862 12.3817 16.6256 13.8562 10.2398 9.6650 5.8228 4.4013 3.7280 4.4118 2.8512 2.6759 3.6089 4.7065 4.5556 4.9982 6.0037 4.8109 4.4328 4.3117 2.8530 3.0054 3.4129 5.8328 3.1393 2.9027 2.2167 2.4688 2.3363 4.0506 3.1290 5.0420 4.3777 4.2165 6.9483 4.5853 5.4352 3.7784 3.9673 1.1220 1.2218 1.2118 1.7891 2.4446 1.8154 1.3488 1.7512 1.4063 2.2247 2.9907 2.8711 1.4045 1.8648 2.2254 4.9106 3.5026 1.9177 1.6309 1.4112 1.7075 1.1528 1.4022 1.5629 1.7345 2.1227 1.1580 1.2971 1.1638 1.1611 1.5373 1.3585 1.2069 1.2592 1.1999 1.3458 1.5594 1.3070 1.3747 1.4402 4.9154 1.4010 2.1887 1.7617 1.0954 1.3462 1.0903 1.0947 1.2205 1.1030 1.1380 1.0880 2.6245 6.4489 6.4130 1.0695 1.0698 1.0600 1.0610 1.0583 1.0579 1.0872 1.0584 1.0728 1.1016 1.0918 1.0914 1.0879 1.0875 1.1088 1.1080 1.1116 1.1117 1.0942 1.0949
irintensity: 0.0180 0.2376 1.1883 1.1669 0.9957 0.5411 3.3334 0.0035 2.7244 6.0440 3.6116 0.1758 1.3499 1.4801 4.5885 3.3356 0.0162 15.9269 3.7749 8.6866 0.2534 0.9088 3.2844 13.5889 0.0867 20.2523 0.0194 24.0029 5.1601 16.3706 5.3905 15.1709 25.3142 3.8864 5.9528 82.3247 105.1617 1.0074 14.1525 3.1957 7.3430 2.4728 88.3023 19.3051 0.2226 0.0961 51.5452 16.3736 13.0707 31.6161 0.0071 2.7491 3.1433 13.8567 0.5658 1.1094 18.1935 0.0374 44.2996 2.2886 9.6042 1.0780 52.0183 52.3085 43.8670 32.4204 65.9354 17.9071 22.3767 11.0575 52.3388 16.4396 2.5431 24.3324 1.9703 280.1181 6.9635 5.4047 23.9390 1.5136 10.8204 0.8033 41.0060 0.4007 16.1856 4.5668 6.5966 36.9432 22.0984 2.0464 4.3450 695.9334 0.1208 0.8237 50.0890 14.5612 32.2038 15.6606 38.8291 0.8088 6.4883 4.4516 31.4473 11.9913 1.4838 8.9569 0.4319 83.9063 12.3430 9.1561 4.4394 16.3079 35.9535 0.7688
temp: 298.150 k
press: 1.00000 atm
elementType: 17 17 17 17 7 7 6 6 6 6 6 6 6 6 6 6 6 6 6 6 1 1 1 1 1 1 1 1 1 1 1 1 1 1 1 1 1 1 1 1
symmnumber: 1
zpe: 839817.1 jmol-1
zpe.correction: 0.319869 hartree
zpe.thermalcorrener: 0.342164 hartree
zpe.thermalcorrenthalpy: 0.343108 hartree
zpe.thermalcorrgfe: 0.263018 hartree
zpe.sumelectzpe: -2493.675842 hartree
zpe.sumelectthermal: -2493.653548 hartree
zpe.sumelectthermalent: -2493.652604 hartree
zpe.sumelectthermalfe: -2493.732693 hartree
dipole: -0.3924 0.0000 -0.0006
dipole: 0.3924
quadrupole: -168.9607 -153.0674 -159.3281
quadrupole: 0.0001 -0.0004 -6.1600
quadrupole: -8.5086 7.3846 1.1239 0.0001 -0.0004 -6.1600
hfenergy: -2493.9957118 hartree
pointgroup: C01 [X(C14H20Cl4N2)]
dipole: -0.1543885 0.0000111 0.0001468 debye
polarizability: 294.865916|0.0792373|191.6374927|0.0623894|-37.823459|167.1520918 unknown
InChI: InChI=1S/C14H20Cl4N2/c15-5-9-19(10-6-16)13-1-2-14(4-3-13)20(11-7-17)12-8-18/h1-4H,5-12H2
charge 0 multiplicity 1
40 atoms
Cl 4.686029 3.359401 -1.584756
Cl 4.689335 -3.352008 1.589535
Cl -4.873044 1.12912 2.472457
Cl -4.868971 -1.134675 -2.473767
N  2.824688 0.002565 0.001936
N  -2.926585 -0.001338 0.000206
C  1.402464 0.001658 0.001554
C  -1.512245 -0.000351 0.000689
C  3.585103 0.85722 -0.920304
C  3.58566 -0.851185 0.924553
C  -3.680014 -0.892069 0.888014
C  -3.680608 0.888334 -0.888139
C  0.65183 -0.861059 0.850363
C  -0.755689 -0.858354 0.853918
C  0.651141 0.863391 -0.847653
C  -0.756372 0.858736 -0.852046
C  3.747985 2.277441 -0.344003
C  3.750531 -2.271212 0.348338
C  -3.780886 -0.416285 2.346262
C  -3.77957 0.412579 -2.346525
H  3.096156 0.907547 -1.909991
H  4.585421 0.419273 -1.086621
H  3.09628 -0.902092 1.913996
H  4.585369 -0.412039 1.091365
H  -3.221522 -1.903294 0.894995
H  -4.694005 -1.027405 0.476267
H  -3.223636 1.900252 -0.894643
H  -4.695147 1.022093 -0.477222
H  1.155679 -1.556184 1.529376
H  -1.2559 -1.550673 1.537555
H  1.154417 1.559247 -1.52634
H  -1.257147 1.550378 -1.535963
H  2.782937 2.77697 -0.178098
H  4.350874 2.28761 0.576194
H  2.786175 -2.771937 0.181999
H  4.353849 -2.280651 -0.571585
H  -4.27129 -1.166887 2.986193
H  -2.810875 -0.113305 2.765352
H  -4.270774 1.162456 -2.986693
H  -2.808742 0.111332 -2.76497
