program: Gaussian 09
title: 000099605
version: EM64L-G09RevD.01
frameworkgroup: C1[X(C7H12N2O3)]
method: RPBEPBE
basis: SDD
operation: Freq
keyword: #p
keyword: freq=noraman
keyword: PBEPBE/SDD
title: #p freq=noraman PBEPBE/SDD
converged: YES YES NO NO
title: Mulliken charges:
elementType: O O O N N C C C C C C C H H H H H H H H H H H H
charge: -0.223305 -0.264477 -0.455034 -0.190739 -0.420967 0.184081 0.189567 -0.682959 -0.675238 0.209939 -0.348638 -0.318125 0.320112 0.214641 0.247744 0.232246 0.240110 0.245019 0.212152 0.261945 0.228058 0.197994 0.245003 0.350872
chargesum: 0.00000
title: Mulliken charges with hydrogens summed into heavy atoms:
elementType: O O O N N C C C C C C C
charge: -0.223305 -0.264477 -0.104161 -0.190739 -0.100855 0.184081 0.189567 0.011672 0.022043 0.209939 0.141364 0.124872
polarizability: 1.13818285e+02 -9.99428432e+00 9.66124276e+01 4.75823499e+00 2.54048398e+00 7.82833242e+01
1716.lowfreq: -13.7047 -12.7668 -0.0011 -0.0008 -0.0005 3.9724 44.6655 46.8072 84.7685
frequency: 43.9075 46.7006 84.7649 117.1601 175.8522 196.2822 201.1929 228.4623 239.0180 269.6140 282.2633 307.8451 320.4282 359.1850 436.8059 459.4217 476.1507 557.6256 603.3961 625.6907 688.1219 698.3051 733.4704 836.1734 862.1160 916.9913 936.3318 957.7225 988.2048 1003.1025 1026.1006 1047.0680 1127.4629 1168.0884 1173.3580 1202.2421 1204.4149 1243.7868 1265.7304 1315.8332 1355.3002 1366.2703 1374.4048 1379.9935 1398.4852 1402.9380 1446.4569 1456.6048 1463.0583 1476.0333 1480.8943 1483.5806 1653.4803 1707.8748 2954.4984 2987.9281 2990.4600 3015.3498 3029.0350 3087.0291 3087.6699 3091.9907 3102.3560 3107.2861 3577.6497 3607.3513
redmass: 4.1230 4.7565 5.3557 5.1633 3.1260 1.0275 3.3509 1.2231 1.5287 1.7209 2.6304 2.6598 3.1069 5.6647 3.7318 1.1749 2.8222 3.4330 7.2038 3.5620 5.3849 8.3276 7.1969 2.7173 3.7197 2.3440 1.5038 1.8938 1.9291 1.3037 3.4702 2.3428 1.9412 2.9715 4.0408 2.1374 1.3063 1.5041 2.4263 1.5374 1.8722 1.6949 1.1959 2.0779 1.4111 1.4304 1.1265 1.0459 1.0496 1.0658 1.0823 1.0678 10.4437 9.8054 1.0600 1.0350 1.0353 1.0644 1.0989 1.1006 1.1027 1.1000 1.1010 1.1005 1.0666 1.0799
irintensity: 6.2250 0.3190 2.0234 2.5792 23.2731 0.0227 6.6471 6.8245 75.7924 64.2739 4.8191 0.3757 4.7055 28.7300 0.2735 158.0391 3.6143 12.1213 11.2236 1.5235 12.7264 8.3691 14.3036 26.5925 10.9508 4.8506 2.2869 10.8026 23.1015 0.5233 47.2299 19.4522 31.8381 12.8516 14.6588 6.3969 49.1662 21.6976 60.8135 100.8636 45.6084 32.5819 19.8139 103.4100 57.3500 7.8723 46.0131 5.3198 3.0720 7.2097 15.9519 22.6682 605.0198 146.2513 70.0300 15.9107 25.5972 21.8774 39.8424 7.5656 3.6264 33.5202 9.8271 21.3807 4.4633 44.3199
temp: 298.150 k
press: 1.00000 atm
elementType: 8 8 8 7 7 6 6 6 6 6 6 6 1 1 1 1 1 1 1 1 1 1 1 1
symmnumber: 1
zpe: 505484.3 jmol-1
zpe.correction: 0.192529 hartree
zpe.thermalcorrener: 0.205543 hartree
zpe.thermalcorrenthalpy: 0.206487 hartree
zpe.thermalcorrgfe: 0.153075 hartree
zpe.sumelectzpe: -608.211153 hartree
zpe.sumelectthermal: -608.198139 hartree
zpe.sumelectthermalent: -608.197194 hartree
zpe.sumelectthermalfe: -608.250607 hartree
dipole: 0.9043 1.1968 1.4162
dipole: 2.0630
quadrupole: -53.6633 -87.2485 -66.4019
quadrupole: 6.5576 0.8930 -1.0815
quadrupole: 15.4413 -18.1440 2.7027 6.5576 0.8930 -1.0815
hfenergy: -608.4036817 hartree
pointgroup: C01 [X(C7H12N2O3)]
dipole: -0.4145438 0.3756615 -0.5880455 debye
dipolederiv: -0.5125644 0.0172702 -0.0507422 -0.1445807 -0.9875512 0.2774787 0.0152257 0.3034305 -0.4776496 -0.8396942 -0.3275872 0.0097746 -0.4099429 -1.0652018 0.1289051 0.0381273 0.1528394 -0.3952811 -0.3980945 0.1283032 -0.1715066 0.2084076 -0.5753246 -0.2465767 -0.1284554 -0.1903434 -0.5458122 -0.9093177 -0.321169 0.0138218 -0.091119 -1.2128511 0.4065847 -0.1328218 0.3066773 -0.3822588 -1.1491252 -0.162402 -0.0687998 -0.1820505 -0.4980345 -0.0901868 -0.0864181 -0.0829332 -0.5445664 0.0171173 0.1768776 -0.1916196 0.3481319 0.4051927 0.1010843 -0.2754923 0.0551815 0.2616454 0.9877951 0.4777138 0.0405151 0.4022915 1.2975563 -0.4576373 0.0921383 -0.3554976 0.3406592 0.024838 -0.0466542 0.0826796 -0.0309823 -0.0119193 -0.0274605 0.0191036 0.0219237 -0.0270362 0.0285525 -0.0416335 0.0165278 -0.0183821 -0.0349389 -0.007455 0.0604536 -0.0715487 -0.0251014 1.5526262 0.263632 0.2484764 0.290689 1.6272863 -0.4021813 0.2609363 -0.4455492 0.4852467 0.587126 -0.0259015 0.1162162 -0.1476826 0.1057254 0.0631317 0.1815413 0.0560813 0.1959492 0.253728 -0.0501706 0.0671944 -0.0672641 0.4267739 0.1969207 0.0590438 0.1899218 0.4730225 0.176531 -0.0240736 -0.0505113 -0.0527992 0.183199 0.0571733 -0.0462184 0.0658162 0.3204378 -0.1051292 0.0654969 -0.0501634 0.0838375 0.0718941 0.035808 -0.0928277 0.0508125 0.0221637 0.0684811 -0.0158129 0.0106518 -0.0721166 -0.0658921 0.0608104 0.0456491 0.0399647 0.087066 0.0741014 -0.0425044 -0.0460388 -0.0148191 0.0195662 -0.1139974 -0.0154392 -0.0986756 -0.0545814 -0.0188298 0.006225 0.1212428 -0.0049853 0.0912916 -0.0021258 0.0951406 -0.0185592 -0.0164483 0.0841519 -0.041337 -0.0030709 -0.0830824 -0.0681932 0.0198381 0.002559 0.0676894 0.0673429 -0.0829786 0.0648722 -0.1086822 0.0918266 0.0409737 0.0326436 -0.0910129 0.0039876 0.030026 0.0745713 -0.0236836 0.0315063 0.0498426 0.0133532 0.0864069 -0.0202271 0.0388895 0.0791588 -0.0296036 -0.0074184 -0.0221238 -0.0540932 0.0172379 -0.1384501 -0.0403106 -0.080265 0.0000625 -0.2281085 -0.0122168 -0.1206732 0.0558535 0.0296822 -0.0352363 -0.0919223 -0.0475959 -0.0209443 0.131595 0.0110107 -0.0373257 -0.0371768 -0.1120064 0.0261298 -0.008642 0.0439105 -0.0236682 0.2122309 -0.0688368 0.1626509 -0.1198033 0.3021806 0.0283916 0.1598694 -0.0061581 0.150567 unknown
polarizability: 112.7265368|11.2990138|97.1362277|1.8905783|-5.1028033|78.8512723 unknown
InChI: InChI=1S/C7H12N2O3/c1-7(2)5(11)9(3-4-10)6(12)8-7/h8,10H,3-4H2,1-2H3
charge 0 multiplicity 1
24 atoms
O  -0.380946 -1.954508 1.048067
O  0.801159 2.387261 -0.351479
O  2.616402 -1.122218 -1.163441
N  0.553404 0.145811 0.451983
N  -1.227943 1.145583 -0.494288
C  -1.726859 -0.201239 -0.1364
C  -0.462221 -0.815764 0.528389
C  -2.88864 -0.147439 0.884318
C  -2.109234 -1.034083 -1.385194
C  0.101613 1.357719 -0.167599
C  1.935327 -0.065449 0.897108
C  2.945872 -0.014073 -0.255398
H  -1.780541 1.86092 -0.962326
H  -3.802208 0.254185 0.409154
H  -3.100798 -1.165582 1.252831
H  -2.628798 0.491045 1.746196
H  -1.278399 -1.057461 -2.110804
H  -2.338921 -2.069683 -1.081636
H  -3.000828 -0.602793 -1.875985
H  1.958328 -1.060203 1.375348
H  2.205386 0.704208 1.643399
H  3.962698 -0.13474 0.175855
H  2.881781 0.966303 -0.766332
H  3.179267 -1.063502 -1.975068
