program: Gaussian 09
title: 000099704
version: EM64L-G09RevD.01
frameworkgroup: C1[X(C24H32N2O)]
method: RPBEPBE
basis: SDD
operation: Freq
keyword: #p
keyword: freq=noraman
keyword: PBEPBE/SDD
title: #p freq=noraman PBEPBE/SDD
converged: YES YES NO NO
title: Mulliken charges:
elementType: O N N C C C C C C C C C C C C C C C C C C C C C C C C H H H H H H H H H H H H H H H H H H H H H H H H H H H H H H H H
charge: -0.259840 -0.071398 -0.602600 0.142584 -0.499623 -0.417721 -0.359899 -0.368572 -0.400355 -0.390908 -0.398324 -0.608767 0.351541 0.110186 0.124466 -0.412719 -0.301201 0.408228 -0.286248 -0.351213 0.380540 -0.477030 -0.443988 -0.308151 -0.248321 -0.800014 -0.797068 0.228680 0.237596 0.210545 0.238135 0.168741 0.206800 0.212373 0.165650 0.203389 0.189511 0.201657 0.191101 0.189287 0.212267 0.235936 0.260321 0.261978 0.221201 0.227580 0.273826 0.326410 0.337662 0.240684 0.238525 0.232339 0.230005 0.212097 0.247706 0.225574 0.215029 0.225442 0.218368
chargesum: 0.00000
title: Mulliken charges with hydrogens summed into heavy atoms:
elementType: O N N C C C C C C C C C C C C C C C C C C C C C C C C
charge: -0.259840 -0.071398 0.061472 0.142584 -0.033347 0.030959 0.015641 0.009452 -0.007455 0.001849 0.003231 -0.112510 0.351541 0.110186 0.124466 -0.150740 -0.080000 0.408228 -0.058668 -0.077387 0.380540 -0.236346 -0.205463 -0.075811 -0.018316 -0.114637 -0.138228
polarizability: 3.43568635e+02 5.47272965e+00 2.44120620e+02 3.62302674e+00 2.82644597e+01 2.39601104e+02
1716.lowfreq: -2.3699 -0.0006 0.0003 0.0007 2.7425 6.1288 21.4373 29.4012 33.1498
frequency: 21.2698 29.3216 33.0319 36.9851 40.2420 56.1533 83.2707 88.3241 91.5564 110.5414 126.9795 133.9073 154.1474 165.8749 167.5220 177.8116 193.2178 203.7560 227.9577 244.9407 269.7044 288.7413 302.0552 320.1376 334.1702 344.0457 379.5239 391.6006 401.3741 413.6138 428.5560 437.5211 449.0082 450.3112 471.7058 476.4036 514.6096 518.6644 529.8185 545.1459 551.8512 564.6228 590.5825 596.9311 619.8331 656.0865 670.2818 741.5213 748.7575 751.6794 770.2412 777.3364 783.6307 788.7464 795.2854 804.8162 817.4109 848.1519 854.5966 860.8056 865.8319 881.2261 905.9102 912.5211 930.8080 949.6687 957.1688 959.8451 969.2928 987.1122 990.9800 993.1632 998.5854 1008.4231 1026.7312 1039.4632 1044.6742 1053.3981 1059.2181 1073.3344 1081.5769 1089.1963 1096.7468 1099.9504 1115.7508 1122.4777 1133.4275 1149.2473 1149.7336 1155.9946 1172.3563 1182.6467 1192.2298 1199.4485 1229.1657 1235.9313 1253.1688 1262.0882 1265.8678 1272.3431 1277.8089 1288.0663 1289.5060 1307.1339 1312.4113 1328.1052 1331.3579 1340.6358 1345.2443 1351.8133 1361.8194 1365.8718 1367.3490 1387.6567 1396.0480 1398.9445 1402.0664 1412.1721 1442.4291 1450.6732 1454.1306 1455.0793 1458.4784 1459.9730 1460.2437 1464.9576 1467.5216 1470.2325 1474.1557 1475.2248 1480.3405 1491.1156 1516.9479 1576.4045 1585.7751 1600.4123 1625.4872 1630.2204 1688.3251 2810.0180 2825.9119 2881.0248 2955.9488 2964.2693 2965.8237 2983.3417 2984.4054 2995.5975 3009.5177 3023.4011 3026.8791 3027.5121 3031.1708 3031.7211 3034.1471 3043.8346 3053.1835 3060.8136 3063.4449 3074.5776 3081.5087 3101.5434 3119.3179 3122.1213 3134.2952 3145.9547 3155.2923 3171.1636 3175.1631 3507.1033 3661.5257
redmass: 3.5763 3.5506 3.0978 3.9730 3.8506 3.7779 3.4153 4.8190 4.3056 3.6315 3.9984 1.1123 3.8475 3.9281 2.3718 2.3965 2.4871 2.2678 2.4096 2.1607 3.3829 3.6251 2.2774 2.8486 2.8818 2.6044 1.8912 3.8034 2.4024 3.0577 3.2700 3.2981 2.6440 2.8746 2.9927 3.0549 4.3003 4.0879 3.5095 1.3324 1.9157 1.6322 2.7836 2.5150 2.6363 3.6750 3.7379 4.5764 1.3995 2.0030 3.3835 3.1697 2.1307 2.7650 2.2084 1.4794 1.7507 2.1439 1.5867 1.6556 2.4733 1.5916 2.3845 1.7464 2.0953 1.3899 1.5853 1.6251 1.3920 1.3797 2.0289 1.4680 1.3185 2.5748 2.7408 2.5433 2.3318 2.0775 2.2425 2.3423 1.6860 2.2706 2.1746 1.9416 2.4280 2.6017 2.2733 1.3777 1.4831 2.2535 1.3670 1.1560 1.3701 1.6764 2.1284 1.7974 1.4392 1.3645 1.1976 1.5676 1.6148 1.6556 1.3833 1.4400 1.2180 2.0862 1.3399 1.4381 1.4920 1.4522 1.6832 1.6813 1.5000 1.2943 1.3941 1.2396 2.7366 4.1532 2.3526 1.0912 1.1404 1.3786 1.3311 1.0696 1.0888 1.0897 1.1125 1.0583 1.1079 1.0693 1.0977 1.0854 3.5174 1.8750 5.9756 5.0131 2.6031 5.9354 6.3551 1.0714 1.0701 1.0697 1.0370 1.0394 1.0622 1.0614 1.0613 1.0588 1.0627 1.0874 1.0899 1.0967 1.0901 1.0963 1.0923 1.1032 1.1036 1.0992 1.0928 1.0984 1.0947 1.0952 1.0870 1.0863 1.0896 1.0954 1.0960 1.0968 1.0934 1.0445 1.1044
irintensity: 0.0357 0.2733 0.1988 0.1787 0.2474 0.0015 1.9037 9.1124 2.6901 0.5522 0.8607 0.3805 0.3871 0.4344 3.7225 0.2366 0.9175 3.3354 1.2913 0.3621 4.1376 3.0864 1.2637 2.4988 1.3660 1.9390 2.9129 5.8116 0.3777 1.2393 1.8747 5.1922 9.2674 2.5692 0.2833 1.4358 6.2918 9.3075 3.8667 140.9733 36.1039 22.9641 0.6459 24.3569 39.6229 2.4449 6.0684 10.3829 5.2037 10.5845 2.7439 4.7589 43.1176 24.1662 9.7921 0.0698 55.3933 2.7862 9.7672 14.8071 0.5638 1.4066 10.3702 4.0964 0.9561 0.4648 11.3802 8.6379 1.0299 2.8691 10.3355 11.6559 0.0357 6.7015 4.7138 6.6757 7.3171 13.3547 3.9335 4.5294 2.7944 9.6804 7.1426 17.2443 19.8976 4.3022 7.1504 7.8311 1.9349 30.2784 1.6792 2.0814 19.0696 1.3542 4.9641 1.8755 2.0460 2.1890 5.5918 4.4989 6.0409 42.0502 8.4930 8.9150 5.8556 68.0249 8.4170 0.4199 12.8952 8.0590 4.5415 2.1467 10.5190 18.1716 2.9039 8.4511 4.3839 4.7259 9.0009 7.0650 3.0688 0.4473 3.3465 6.6567 12.1990 11.8402 5.4844 22.3438 1.6948 16.5954 7.1071 16.9674 13.4439 90.6342 10.9697 12.2389 200.4594 9.7578 7.7322 56.1501 131.1426 80.2936 39.8258 44.2336 39.2834 33.3123 38.0001 14.5159 8.3801 48.2630 84.3151 9.0951 25.1524 42.7663 20.4719 20.2910 95.4993 22.6589 21.5229 14.8750 66.9479 26.0165 1.5204 3.1804 12.9117 30.1678 32.8543 14.1096 9.4323 27.6759 29.0663
temp: 298.150 k
press: 1.00000 atm
elementType: 8 7 7 6 6 6 6 6 6 6 6 6 6 6 6 6 6 6 6 6 6 6 6 6 6 6 6 1 1 1 1 1 1 1 1 1 1 1 1 1 1 1 1 1 1 1 1 1 1 1 1 1 1 1 1 1 1 1 1
symmnumber: 1
zpe: 1331007.4 jmol-1
zpe.correction: 0.506954 hartree
zpe.thermalcorrener: 0.533635 hartree
zpe.thermalcorrenthalpy: 0.534579 hartree
zpe.thermalcorrgfe: 0.449233 hartree
zpe.sumelectzpe: -1116.458641 hartree
zpe.sumelectthermal: -1116.431960 hartree
zpe.sumelectthermalent: -1116.431016 hartree
zpe.sumelectthermalfe: -1116.516362 hartree
dipole: -0.8198 0.5967 2.8742
dipole: 3.0478
quadrupole: -148.1573 -157.1513 -166.1995
quadrupole: 2.4217 -2.8054 -3.6334
quadrupole: 9.0120 0.0181 -9.0302 2.4217 -2.8054 -3.6334
hfenergy: -1116.9655953 hartree
pointgroup: C01 [X(C24H32N2O1)]
dipole: 0.3474486 0.3698976 1.0864005 debye
polarizability: 342.4811643|8.3235639|219.3079804|-8.0657264|-16.9996809|265.5012138 unknown
InChI: InChI=1S/C24H32N2O/c1-19(2)13-14-24(23(25)27,15-18-26-16-6-3-7-17-26)22-12-8-10-20-9-4-5-11-21(20)22/h4-5,8-13H,3,6-7,14-18,25H2,1-2H3
charge 0 multiplicity 1
59 atoms
O  -0.227165 1.056265 -2.996843
N  -3.786055 0.371151 -0.041731
N  0.284041 2.63243 -1.385674
C  0.092403 0.264723 -0.647957
C  -1.29134 0.417383 0.079924
C  -2.531425 0.334848 -0.838644
C  -4.115731 -0.945944 0.561815
C  -4.937073 0.902184 -0.817876
C  -5.333189 -0.843921 1.503157
C  -6.177754 1.074484 0.082036
C  -6.555756 -0.264315 0.75624
C  0.212055 -1.176516 -1.290613
C  1.278127 0.505756 0.319614
C  0.061743 1.331615 -1.792234
C  2.645759 0.625831 -0.172088
C  1.06816 0.553634 1.706602
C  -0.237612 -2.307976 -0.390176
C  3.731184 0.778213 0.783061
C  2.138357 0.706107 2.640056
C  2.996603 0.598216 -1.567866
C  0.545464 -3.149806 0.347168
C  3.450139 0.814484 2.188363
C  5.08368 0.892593 0.317618
C  4.323003 0.711086 -1.991219
C  5.382508 0.858101 -1.044127
C  2.06072 -3.084121 0.416846
C  -0.079156 -4.255408 1.184601
H  -1.338583 1.387787 0.608534
H  -1.359624 -0.375529 0.845605
H  -2.484417 -0.573736 -1.487596
H  -2.538607 1.2020 -1.523614
H  -4.333848 -1.704187 -0.239456
H  -3.238379 -1.312936 1.125434
H  -4.642849 1.87696 -1.249685
H  -5.198985 0.224123 -1.674425
H  -5.071694 -0.184524 2.353474
H  -5.565146 -1.845895 1.913634
H  -5.948039 1.828087 0.860241
H  -7.021213 1.460082 -0.522762
H  -6.887749 -0.984944 -0.020176
H  -7.405453 -0.124019 1.451122
H  1.254425 -1.334275 -1.613419
H  -0.395514 -1.163202 -2.214508
H  0.055769 0.461322 2.105588
H  -1.325578 -2.474906 -0.349434
H  1.914754 0.732935 3.712178
H  2.219296 0.496556 -2.329485
H  0.240405 3.376126 -2.08189
H  0.589171 2.8468 -0.436741
H  4.281873 0.928776 2.893754
H  5.883059 1.007639 1.059751
H  4.551803 0.687511 -3.06234
H  6.418399 0.944509 -1.389684
H  2.503293 -4.07666 0.200554
H  2.496067 -2.351664 -0.280646
H  2.38987 -2.803509 1.437494
H  0.200084 -4.150252 2.25232
H  -1.181266 -4.252725 1.115227
H  0.282786 -5.252045 0.861598
