program: Gaussian 09
title: 000099570
version: EM64L-G09RevD.01
frameworkgroup: C1[X(C8H7BrO2)]
method: RPBEPBE
basis: SDD
operation: Freq
keyword: #p
keyword: freq=noraman
keyword: PBEPBE/SDD
title: #p freq=noraman PBEPBE/SDD
converged: YES YES NO NO
title: Mulliken charges:
elementType: Br O O C C C C C C C C H H H H H H H
charge: 0.024644 -0.446616 -0.251020 0.371530 0.111013 -0.350409 -0.305797 -0.774861 -0.197504 -0.199665 0.107737 0.259295 0.286609 0.216458 0.252498 0.252278 0.257846 0.385964
chargesum: 0.00000
title: Mulliken charges with hydrogens summed into heavy atoms:
elementType: Br O O C C C C C C C C
charge: 0.024644 -0.060652 -0.251020 0.371530 0.111013 -0.091114 -0.019188 -0.053627 -0.197504 0.058180 0.107737
polarizability: 1.80413255e+02 -2.00765936e+00 1.08756697e+02 1.14312896e-02 5.51196281e-03 4.47987823e+01
1716.lowfreq: -4.9957 -4.3511 -0.0006 -0.0005 0.0006 4.0878 48.7710 71.8990 154.3242
frequency: 48.7001 71.8983 154.3241 168.7278 193.7925 229.9686 257.9714 258.2212 356.4205 432.6352 433.9184 497.9842 529.1616 555.3257 589.0625 629.1408 679.6749 710.6740 756.6880 842.6555 842.8719 883.0666 984.2278 990.9230 1004.5302 1043.2790 1085.4959 1121.5973 1163.9070 1208.9045 1273.8303 1310.2341 1370.3492 1378.3920 1407.6336 1455.3303 1462.7413 1469.7835 1560.3985 1591.5812 1637.1359 2995.5467 3079.7589 3097.8859 3159.1931 3168.0531 3187.8248 3531.9959
redmass: 8.1723 7.2764 8.4585 1.4964 1.6899 9.6551 5.6508 5.0055 4.2296 7.1445 2.8296 4.0976 3.3056 6.0345 1.2877 5.3509 3.6040 5.0255 3.8434 6.1796 1.5010 1.3469 1.3633 4.4711 1.6337 1.5705 2.2434 1.7448 1.6357 2.3854 1.3125 2.6049 4.5201 3.8147 1.2405 1.0449 1.4789 1.7703 8.0553 6.4238 8.1300 1.0365 1.0959 1.1015 1.0925 1.0891 1.0970 1.0642
irintensity: 0.9829 0.0365 0.3752 2.1656 0.3334 1.9147 0.3081 2.3210 5.3438 22.8274 21.0791 19.5955 15.5659 3.1345 84.3785 13.4218 66.4473 11.0114 15.9537 49.3161 27.3440 11.7572 0.5076 329.7706 6.8842 10.6139 44.8514 66.9217 43.2249 22.0381 5.0168 81.7225 13.0153 8.6942 22.5675 13.3129 44.4413 24.9053 98.1103 67.0850 332.6136 12.6945 7.5396 22.5055 3.3835 0.6803 1.7278 52.1647
temp: 298.150 k
press: 1.00000 atm
elementType: 35 8 8 6 6 6 6 6 6 6 6 1 1 1 1 1 1 1
symmnumber: 1
zpe: 340118.8 jmol-1
zpe.correction: 0.129544 hartree
zpe.thermalcorrener: 0.139941 hartree
zpe.thermalcorrenthalpy: 0.140885 hartree
zpe.thermalcorrgfe: 0.092066 hartree
zpe.sumelectzpe: -472.181030 hartree
zpe.sumelectthermal: -472.170633 hartree
zpe.sumelectthermalent: -472.169689 hartree
zpe.sumelectthermalfe: -472.218508 hartree
dipole: -0.4678 -0.6790 0.0046
dipole: 0.8246
quadrupole: -74.5619 -66.5416 -75.4546
quadrupole: 6.2761 -0.0295 0.0235
quadrupole: -2.3759 5.6444 -3.2685 6.2761 -0.0295 0.0235
hfenergy: -472.3105744 hartree
pointgroup: C01 [X(C8H7Br1O2)]
dipole: -0.184973 0.266328 -0.0096796 debye
dipolederiv: -0.8467909 -0.0030427 0.0185316 0.0353494 -0.0623165 0.000771 0.0167633 0.0014721 -0.0299674 -0.641627 0.436175 -0.0165116 0.6330291 -1.0970552 0.0182285 -0.0265263 0.0227863 -0.4317634 -1.0760715 -0.2501884 0.0299505 -0.2064176 -0.7611027 0.0268695 0.0270663 0.0278339 -0.3123012 0.3893883 0.3136982 -0.0223446 -0.123193 0.3202523 -0.010757 -0.0023921 -0.0208454 0.0166336 -0.8690156 0.0928252 0.0148876 -0.0277507 -0.1671244 0.0075654 0.0204037 0.0049037 -0.0202176 -0.630851 -0.3464544 0.0268225 -0.1542539 -0.1099966 0.003117 0.0182187 0.0075445 -0.1178474 0.3241966 -0.1245835 -0.0038282 0.2699192 -0.0225134 -0.0093409 -0.0220213 -0.0007741 -0.0966174 -0.0479944 -0.2656693 0.0131632 -0.1010924 -0.0927022 0.0073242 0.0061833 0.0113594 0.0150335 1.5076014 -0.0076316 -0.0356909 -0.0821269 0.2531133 -0.0136566 -0.0322585 -0.0152072 -0.0947588 -0.6086469 0.244693 0.0002742 0.1763262 -0.0823424 -0.0054632 0.0032143 -0.0069515 -0.116597 2.04341 -0.1832597 -0.0329239 -0.3097706 1.4494565 -0.0536459 -0.0260738 -0.0559957 0.2251399 0.066041 0.0464934 -0.0000797 0.0641143 -0.0275435 0.0065894 -0.0008764 0.0069675 0.1544132 0.0919596 0.0421478 -0.0002855 0.0296458 0.0209768 0.0054554 0.0003795 0.0053438 0.1601288 -0.016296 0.1907998 -0.0053908 0.0609982 -0.059619 0.0057743 0.0002132 0.002618 0.1070352 0.0508387 -0.0190448 0.0893342 -0.0120571 0.0575679 -0.0170567 0.0844654 0.0138684 -0.0143213 0.0422047 -0.0275444 -0.0901689 -0.0186847 0.057326 0.0119464 -0.0860684 -0.0188083 -0.0060149 0.047247 -0.0678689 0.0056389 -0.0671571 0.0018332 0.008727 0.0056425 0.0086926 0.1643195 0.174406 -0.0715446 0.0086214 -0.166878 0.3217897 0.0075522 0.0136665 0.005192 0.3977027 unknown
polarizability: 180.3298806|2.1217166|108.6378053|-3.140071|-2.9238532|45.0010481 unknown
InChI: InChI=1S/C8H7BrO2/c1-5-4-6(9)2-3-7(5)8(10)11/h2-4,10H,1H3
charge 0 multiplicity 1
18 atoms
Br 4.088536 0.059014 -0.059203
O  -2.616412 1.651491 0.014825
O  -2.986708 -0.629776 0.134746
C  -0.020102 -1.049025 0.082129
C  -0.679905 0.223647 0.040454
C  1.398496 -1.062145 0.050489
C  0.084365 1.421095 -0.029988
C  -0.751769 -2.374748 0.157364
C  2.129806 0.138956 -0.018893
C  1.490329 1.39515 -0.060086
C  -2.163454 0.317757 0.069651
H  1.92507 -2.020533 0.080905
H  -0.443306 2.377346 -0.061115
H  -0.033419 -3.211498 0.176471
H  -1.392789 -2.431454 1.054282
H  -1.434999 -2.507886 -0.699425
H  2.068468 2.321216 -0.113915
H  -3.610607 1.642295 0.03811
