program: Gaussian 09
title: 000099561
version: EM64L-G09RevD.01
frameworkgroup: C1[X(C13H8N2O2)]
method: RPBEPBE
basis: SDD
operation: Freq
keyword: #p
keyword: freq=noraman
keyword: PBEPBE/SDD
title: #p freq=noraman PBEPBE/SDD
converged: NO NO NO NO
title: Mulliken charges:
elementType: O O N N C C C C C C C C C C C C C H H H H H H H H
charge: -0.375826 -0.249538 0.112423 0.055574 -0.179557 0.465126 -0.148111 0.444701 -0.437972 -0.437687 -0.310750 -0.323843 -0.026748 -0.283233 -0.172307 -0.372332 0.123448 0.238211 0.236811 0.251443 0.247175 0.279459 0.233382 0.248595 0.381557
chargesum: 0.00000
title: Mulliken charges with hydrogens summed into heavy atoms:
elementType: O O N N C C C C C C C C C C C C C
charge: 0.005731 -0.249538 0.112423 0.055574 -0.179557 0.465126 -0.148111 0.444701 -0.199761 -0.200876 -0.059307 -0.076669 -0.026748 -0.003775 0.061075 -0.123737 0.123448
polarizability: 2.70770294e+02 1.63453563e+01 1.87599564e+02 3.89137253e-04 -9.18408197e-04 6.00491198e+01
1716.lowfreq: -6.9962 -0.0008 0.0002 0.0005 6.9534 10.2240 41.2234 64.0960 102.2059
frequency: 41.2145 64.0939 102.2055 121.0485 150.3147 238.5001 244.2549 268.3878 315.9253 407.9630 410.9307 423.5154 431.6977 493.9274 516.0527 522.3974 551.8284 571.0637 588.6833 609.9552 640.1322 669.4285 695.5378 727.2855 750.0418 766.1378 791.3093 844.0329 859.6841 861.1724 874.8222 884.9250 941.7971 977.3740 991.9365 1003.2188 1021.7837 1032.3280 1064.1306 1071.3473 1134.3500 1154.0755 1176.3107 1206.1656 1230.8129 1232.5043 1289.6242 1316.4872 1342.3251 1349.8415 1381.6483 1400.2417 1409.7947 1435.7139 1480.6060 1495.3742 1525.6083 1578.1939 1600.8174 1610.6619 1619.2855 3118.6655 3124.0694 3132.5116 3137.6506 3143.4690 3165.4253 3179.1086 3502.7598
redmass: 9.7687 6.1112 4.9411 7.2802 5.4594 4.9442 7.1650 4.2628 9.3495 3.7201 6.3717 7.0702 4.0528 3.1650 7.9119 4.4588 2.8744 6.7321 2.5199 8.5635 1.6478 5.3241 7.1225 4.3463 6.5188 2.1015 1.5463 1.7504 5.6904 5.5476 6.6165 1.6362 1.4197 1.3565 1.3974 1.3756 3.4579 3.8074 2.5503 3.0383 1.2989 1.2188 1.7752 1.6607 1.6889 2.8059 2.2588 5.0866 3.0691 8.7669 2.7705 2.3001 2.2514 3.9721 4.2156 4.3510 5.6299 6.4970 6.6487 8.5871 7.0619 1.0863 1.0885 1.0912 1.0910 1.0981 1.0995 1.0964 1.0639
irintensity: 1.6795 0.8059 6.9005 0.8070 2.7689 0.0812 4.9071 0.5637 2.4346 1.2753 4.8607 5.3696 0.1570 13.5145 0.9336 14.2269 17.3891 32.0236 21.7770 7.1318 71.5395 14.7496 6.6629 75.7235 9.5890 0.0029 13.5876 10.8200 7.7664 7.9705 1.8471 89.9441 1.6497 0.6074 0.6716 0.1139 8.1027 230.9749 9.4969 48.3553 10.3144 0.2748 22.3932 12.3342 3.4307 3.4115 4.8918 1.4452 75.5505 9.9601 31.9266 2.0977 18.1668 11.5621 34.9453 7.3815 12.5828 8.4158 8.0642 262.5214 26.6761 0.4417 12.4855 12.4994 6.4945 33.7299 33.4580 2.5202 41.8444
temp: 298.150 k
press: 1.00000 atm
elementType: 8 8 7 7 6 6 6 6 6 6 6 6 6 6 6 6 6 1 1 1 1 1 1 1 1
symmnumber: 1
zpe: 472623.6 jmol-1
zpe.correction: 0.180013 hartree
zpe.thermalcorrener: 0.192475 hartree
zpe.thermalcorrenthalpy: 0.193420 hartree
zpe.thermalcorrgfe: 0.140400 hartree
zpe.sumelectzpe: -758.997454 hartree
zpe.sumelectthermal: -758.984991 hartree
zpe.sumelectthermalent: -758.984047 hartree
zpe.sumelectthermalfe: -759.037066 hartree
dipole: -4.1831 2.8897 0.0004
dipole: 5.0842
quadrupole: -85.1254 -82.1282 -100.0477
quadrupole: -2.3240 0.0032 0.0005
quadrupole: 3.9750 6.9722 -10.9473 -2.3240 0.0032 0.0005
hfenergy: -759.1774666 hartree
pointgroup: C01 [X(C13H8N2O2)]
dipole: 1.6132264 1.1826148 -0.0001396 debye
dipolederiv: -0.2561649 0.0451519 -0.0000245 -0.2757621 -1.2404796 -0.0002194 -0.0000971 -0.0002187 -0.3831057 -1.2525148 0.1127496 0.000164 -0.1535566 -0.6362473 -0.0000764 0.0000916 -0.0001044 -0.3275653 -0.1514982 0.158785 0.0000011 0.0170277 -0.1920799 0.0000096 -0.0000428 -0.0000074 -0.1783423 -0.380272 0.1263217 -0.0000046 0.1655974 -0.3109516 0.0000044 -0.0000019 0.0000054 -0.2065686 0.2355523 -0.0588645 0.0000042 -0.3839784 -0.0374694 -0.0000055 0.0000065 0.0000018 0.0414039 0.1350797 -0.0217365 -0.0000001 0.3662218 -0.1896182 0.0000091 -0.0000089 -0.000005 0.0896827 0.2680171 -0.1853313 0.0000061 -0.1044267 0.1251616 -0.0000043 0.0000055 -0.0000017 0.0171611 -0.2269819 -0.0367352 -0.0000033 -0.2134971 -0.0838124 -0.0000004 0.0000003 0. 0.0857171 -0.2227222 0.0233949 -0.0000024 0.0962296 0.134265 -0.0000015 -0.0000061 0.0000039 -0.1688826 0.0781412 0.0932105 0.0000032 -0.0626614 0.1454118 -0.000002 0.0000041 -0.0000007 -0.1541344 -0.0430431 0.011753 0.0000043 -0.1003903 0.2515871 -0.0000066 0.000008 -0.0000041 -0.1437991 0.2138386 0.0195575 0.0000036 0.110325 0.1217681 -0.0000013 0.0000023 -0.0000032 -0.1439211 -0.357941 -0.2109079 0.0000206 -0.1016699 0.0843151 -0.0000211 0.0000417 -0.0000095 0.0738695 -0.0641266 -0.0853115 0.0000009 -0.0433845 -0.1525322 -0.0000013 0.0000095 0.00002 -0.0875641 0.0556896 -0.1774534 0.0000029 0.006339 -0.2565834 0.000003 -0.0000013 0.0000032 -0.1034518 0.1286946 0.1126197 0.0000007 -0.0702511 0.4152508 -0.0000088 0.0000056 -0.0000105 -0.0612943 1.6975703 0.0847302 -0.0002088 0.6485476 1.5806497 0.0003122 -0.0000869 0.0003075 0.198367 0.0597665 0.0616759 -0.0000019 -0.0211162 -0.1054308 0.000002 -0.0000012 0.0000005 0.1578466 -0.0535382 -0.1222656 -0.0000019 -0.0443529 0.0098129 0.0000005 -0.0000008 -0.0000012 0.1548125 0.0853635 -0.0226472 -0.0000006 0.0318299 -0.0909196 0.0000041 -0.0000025 0.0000029 0.1449948 -0.0240666 -0.0587904 -0.000001 -0.1301047 0.0141332 0.0000002 -0.000001 0.0000007 0.1459973 0.0216647 0.0657274 -0.0000058 0.0475611 0.1206232 0.0000015 -0.0000052 -0.0000078 0.1647568 -0.0902641 0.0951378 -0.0000029 0.0897874 0.0575582 0.0000019 -0.0000019 0.0000014 0.1621261 0.0603704 0.0312898 -0.0000016 0.0750721 -0.121559 0.0000051 -0.0000034 0.0000062 0.129016 0.0833851 -0.0620615 0.0000478 0.0506135 0.3571469 -0.0000049 0.000086 0.0000209 0.3928778 unknown
polarizability: 271.6215474|-13.9873743|186.7483101|0.0003632|0.000929|60.0491198 unknown
InChI: InChI=1S/C13H8N2O2/c16-13(17)10-6-5-9-4-3-8-2-1-7-14-11(8)12(9)15-10/h1-7,16H
charge 0 multiplicity 1
25 atoms
O  -3.233289 -2.317927 -0.00034
O  -4.711632 -0.531343 0.000315
N  -1.088126 -0.626537 0.000016
N  1.479392 -1.74533 0.000073
C  -0.000415 0.211722 0.000038
C  -0.135578 1.654162 0.000008
C  1.346951 -0.373936 0.000053
C  2.489806 0.511954 0.000055
C  1.036016 2.495744 0.000015
C  2.302521 1.943936 0.000041
C  -1.456805 2.198563 -0.000023
C  3.791542 -0.076861 0.000073
C  -2.321026 -0.068864 -0.000017
C  -2.559079 1.341494 -0.000017
C  3.917741 -1.470356 0.000089
C  2.729371 -2.260345 0.000088
C  -3.52877 -0.962734 0.000012
H  0.901843 3.58402 0.000006
H  3.190016 2.58867 0.000049
H  -1.592066 3.285978 -0.000039
H  4.676138 0.570676 0.000075
H  -3.58941 1.706444 -0.000012
H  4.899128 -1.954927 0.000101
H  2.793754 -3.355164 0.00011
H  -4.090421 -2.826839 -0.000268
