program: Gaussian 09
title: 000099558
version: EM64L-G09RevD.01
frameworkgroup: C1[X(C5H12N2O2S)]
method: RPBEPBE
basis: SDD
operation: Freq
keyword: #p
keyword: freq=noraman
keyword: PBEPBE/SDD
title: #p freq=noraman PBEPBE/SDD
converged: YES YES NO NO
title: Mulliken charges:
elementType: S O O N N C C C C C H H H H H H H H H H H H
charge: 0.133584 -0.426500 -0.236084 -0.618755 -0.550719 -0.104103 -0.697707 -0.643825 -0.360423 0.239421 0.249521 0.253376 0.282195 0.241326 0.295288 0.225882 0.219006 0.299588 0.280104 0.267766 0.271311 0.379746
chargesum: 0.00000
title: Mulliken charges with hydrogens summed into heavy atoms:
elementType: S O O N N C C C C C
charge: 0.133584 -0.046754 -0.236084 -0.039062 -0.011643 0.145418 -0.162136 -0.107211 0.084465 0.239421
polarizability: 1.24050017e+02 -8.74327601e+00 8.74355606e+01 -3.61500113e+00 9.30061724e-01 7.07770896e+01
1716.lowfreq: -19.6273 -8.8921 -6.5586 -0.0024 -0.0021 0.0018 8.1506 38.1168 52.9837
frequency: 5.9368 37.7997 52.9287 71.3642 130.1088 141.1316 180.7938 228.0324 239.1331 253.0223 278.0748 296.3868 347.0667 394.8995 464.4521 544.4563 576.9342 580.6874 635.9518 688.5988 690.9518 735.1742 765.9866 767.5048 916.1026 933.3804 989.1014 1023.3444 1047.8726 1068.8206 1087.7333 1089.9332 1152.1233 1210.8012 1239.4193 1252.2084 1260.2907 1266.4422 1305.8162 1330.5093 1346.3264 1390.7193 1431.6606 1453.0044 1470.0636 1627.5154 1641.8341 1676.6921 2903.7838 2998.4230 3011.1401 3028.4898 3056.6074 3101.1981 3111.2735 3462.0796 3462.7862 3514.7953 3590.0367 3595.7569
redmass: 3.4793 4.9382 3.9659 2.6576 5.1057 3.7846 3.1839 4.7104 1.1953 3.8724 1.0717 2.5001 3.2541 5.6172 4.1014 3.5390 1.4039 1.3296 1.4098 4.1303 4.9356 4.3568 2.5742 1.1427 1.9674 1.2153 3.1220 4.6630 2.3292 1.0987 2.8059 3.3856 1.1373 1.4349 1.1833 1.2179 1.6093 1.3191 1.3487 1.1547 1.2336 1.9047 1.0941 1.0786 1.0916 1.0961 1.0888 8.8459 1.0813 1.0603 1.0580 1.0602 1.1036 1.1088 1.1044 1.0445 1.0446 1.0640 1.0982 1.0986
irintensity: 0.6623 4.9233 1.7088 3.7211 2.8197 3.1133 5.2732 1.0226 42.2440 4.7314 60.2062 14.2805 9.6615 7.9985 41.0289 20.9231 318.8774 74.9799 309.3293 33.3256 64.9438 8.2271 2.4194 6.9857 9.2119 0.6439 21.2503 25.7831 314.7522 3.1210 5.5080 27.0507 4.5371 0.9026 7.8414 3.4528 17.7679 0.5249 9.0232 0.1933 0.7081 11.1648 19.2205 2.1925 7.0271 45.5322 37.8874 210.8123 46.0586 20.3371 41.7335 26.0476 21.9964 13.9569 6.8244 3.3967 2.5948 23.5038 0.9647 4.5120
temp: 298.150 k
press: 1.00000 atm
elementType: 16 8 8 7 7 6 6 6 6 6 1 1 1 1 1 1 1 1 1 1 1 1
symmnumber: 1
zpe: 467473.5 jmol-1
zpe.correction: 0.178051 hartree
zpe.thermalcorrener: 0.191154 hartree
zpe.thermalcorrenthalpy: 0.192098 hartree
zpe.thermalcorrgfe: 0.135501 hartree
zpe.sumelectzpe: -854.903366 hartree
zpe.sumelectthermal: -854.890264 hartree
zpe.sumelectthermalent: -854.889320 hartree
zpe.sumelectthermalfe: -854.945917 hartree
dipole: 2.4614 0.1444 0.8590
dipole: 2.6110
quadrupole: -64.7005 -62.2103 -71.2779
quadrupole: 0.3299 -8.7070 -2.5695
quadrupole: 1.3624 3.8526 -5.2150 0.3299 -8.7070 -2.5695
hfenergy: -855.0814175 hartree
pointgroup: C01 [X(C5H12N2O2S1)]
dipole: -0.9522266 -0.1875009 -0.3366464 debye
dipolederiv: -0.4675372 -0.0435543 0.0991029 -0.0489709 -0.2486171 0.0565655 0.083705 0.0458197 -0.0823886 -0.9216204 0.4215694 0.0269581 0.5902199 -0.7615835 -0.1421878 0.0051288 -0.1123282 -0.3281129 -0.8346056 0.1907634 0.1710728 -0.00372 -0.5142502 0.1951392 0.3254934 0.0611139 -0.5653719 -0.7177366 -0.0996136 -0.1064308 -0.0501872 -0.3663083 -0.0993507 -0.115286 -0.1349935 -0.6797191 -0.954295 -0.4403687 0.1008069 -0.550242 -0.4949132 0.0134424 -0.013249 -0.0685461 -0.3827783 0.4791477 0.1169958 0.1973178 -0.0051162 0.1043668 0.138133 -0.011949 0.1016214 0.3095229 0.2687458 0.0228902 0.0676426 0.1001546 0.1086611 0.0003748 0.1442975 0.0065161 0.0048672 0.2453164 0.0263796 -0.2029687 -0.0267536 0.1179323 -0.0541007 -0.3823184 -0.1133102 0.0753946 0.538276 0.1646691 -0.1040092 0.258489 0.3058125 -0.0602669 0.0755419 0.0427752 0.3148796 1.3037086 -0.4870046 -0.3638356 -0.5389743 1.0129981 -0.2288409 -0.4210171 -0.1238161 0.571536 -0.0063428 -0.0318575 -0.0233497 -0.0415085 -0.0205981 -0.0775562 -0.064601 -0.1039524 -0.1495749 -0.0624203 -0.1091083 0.0030908 -0.0771942 -0.0933142 0.0549161 -0.0106972 0.0687583 0.0584509 -0.0082516 0.004827 0.005263 -0.0047097 0.0977908 -0.0134823 0.0147874 -0.0691761 -0.0529163 -0.0486804 0.0489905 0.0917535 0.0352004 -0.089493 -0.0676998 0.0917938 -0.069691 -0.0164821 0.0694067 -0.0308541 -0.0008366 -0.0106796 0.0348072 0.0606473 -0.0009516 0.0471035 -0.0360353 0.0163095 0.0662496 0.0776781 0.045872 -0.0832402 -0.0721116 0.0384567 -0.070327 0.0288201 -0.0123946 0.0247069 -0.0570727 0.0341146 0.0236723 0.1176251 -0.0888736 0.0710851 -0.0659916 0.0544557 0.0434915 -0.0239572 0.0576599 0.1480783 -0.0271168 0.101751 -0.0273145 0.3441778 0.2047098 -0.0428462 -0.0224682 -0.0296914 0.1169664 0.11475 -0.0004904 0.2000069 0.2256891 0.3413293 0.0759911 0.0426998 0.1572861 0.06892 -0.0458469 0.1513042 -0.0151536 0.1285296 0.1950614 0.1447035 -0.0729649 0.1476544 0.2872942 0.0259986 0.0091607 0.1195374 0.0569447 0.3174176 -0.0670203 0.0945073 -0.0389033 0.2450178 0.1109685 0.0680126 0.1442714 0.2405587 unknown
polarizability: 123.4409926|8.3324079|82.9803549|-6.2152053|-8.1270329|75.8413198 unknown
InChI: InChI=1S/C5H12N2O2S/c6-1-2-10-3-4(7)5(8)9/h4,8H,1-3,6-7H2
charge 0 multiplicity 1
22 atoms
S  1.144985 -1.00501 1.438325
O  -2.408866 1.462146 -0.096312
O  -0.436712 0.798104 -1.117382
N  -2.775761 -1.352256 0.064024
N  4.42574 0.787192 -0.473416
C  -1.554087 -0.681597 0.567894
C  -0.352087 -1.638015 0.466694
C  2.324944 -0.528793 0.014904
C  3.449544 0.386731 0.55666
C  -1.351433 0.563059 -0.302508
H  -1.637003 -0.327218 1.622593
H  -0.620856 -2.615135 0.90395
H  -0.058892 -1.786697 -0.584323
H  2.745503 -1.458248 -0.409111
H  1.718489 -0.004934 -0.742615
H  2.999758 1.29769 0.992427
H  3.993409 -0.122356 1.37455
H  -3.603718 -0.748691 0.052101
H  -2.950935 -2.264203 0.496057
H  4.998611 0.021472 -0.840562
H  4.03811 1.37244 -1.2196
H  -2.297042 2.250719 -0.693651
