program: Gaussian 09
title: 000099575
version: EM64L-G09RevD.01
frameworkgroup: C1[X(C14H21NO3)]
method: RPBEPBE
basis: SDD
operation: Freq
keyword: #p
keyword: freq=noraman
keyword: PBEPBE/SDD
title: #p freq=noraman PBEPBE/SDD
converged: YES YES NO NO
title: Mulliken charges:
elementType: O O O N C C C C C C C C C C C C C C H H H H H H H H H H H H H H H H H H H H H
charge: -0.294642 -0.453946 -0.272039 -0.447720 0.361065 -0.510163 0.572848 -0.623332 -0.027827 -0.342087 0.246346 -0.631938 -0.635616 -0.265856 -0.024207 -0.521639 -0.594622 -0.496069 0.245675 0.232678 0.247746 0.287926 0.239131 0.223505 0.254564 0.215897 0.218160 0.206805 0.178928 0.228811 0.408221 0.271835 0.201981 0.222692 0.212307 0.217498 0.206527 0.202890 0.237667
chargesum: 0.00000
title: Mulliken charges with hydrogens summed into heavy atoms:
elementType: O O O N C C C C C C C C C C C C C C
charge: -0.294642 -0.045725 -0.272039 -0.159795 0.361065 -0.031810 0.572848 -0.375586 -0.027827 0.120550 0.246346 -0.377375 -0.201559 0.119876 0.204604 0.174869 -0.164817 0.151015
polarizability: 2.20536329e+02 1.75384188e+01 2.03211253e+02 -1.09064708e+00 7.89495597e+00 1.10963106e+02
1716.lowfreq: -8.5334 -4.5186 -0.0007 -0.0004 0.0003 3.3081 22.4877 26.8446 41.3837
frequency: 22.4786 26.8072 41.3758 45.1494 52.3387 62.2220 83.0060 97.5564 110.5507 122.4410 143.1020 163.2732 198.4225 213.3994 220.1436 237.3585 252.1883 265.8073 283.9589 329.0850 365.3767 376.4193 396.4668 443.0150 446.3686 472.2569 505.0588 550.4091 577.1722 611.9386 652.2227 682.1261 743.6310 775.9790 806.8422 827.9736 870.9494 883.7520 889.7540 894.7774 914.4286 932.1113 943.6447 961.3847 978.4556 1011.0275 1012.2371 1041.1022 1059.9463 1092.5438 1103.9342 1109.4342 1110.4362 1115.8552 1125.5287 1134.2683 1157.9632 1161.7234 1170.8388 1171.4733 1208.2092 1217.8073 1227.8186 1252.0898 1275.0390 1279.7591 1292.7366 1297.4378 1315.3735 1346.8536 1365.8552 1394.7669 1415.7705 1423.6883 1428.7668 1437.5590 1440.2673 1451.6437 1455.0397 1458.3660 1461.3689 1468.4675 1474.7083 1482.8965 1484.3230 1493.9994 1519.4648 1613.8124 1624.0359 1652.7305 2472.3470 2905.5575 2930.5804 2953.5997 2957.4112 2965.3625 2969.3937 2972.6020 3004.8222 3008.3287 3015.9641 3058.5032 3080.0982 3081.0985 3093.8936 3108.5911 3117.8421 3127.5351 3141.6897 3192.7900 3404.4273
redmass: 3.7053 3.3114 3.2082 1.9778 2.0436 3.3610 2.8487 2.8073 2.5178 1.9778 2.3169 2.6180 3.6517 1.3203 3.0658 3.5635 3.7608 3.6655 3.5988 3.4750 3.7730 4.4084 3.1011 5.5154 3.5192 3.7051 2.9569 3.7164 2.6652 3.5509 3.7279 3.2424 4.3166 3.5202 1.1946 1.1808 1.8112 3.2954 2.2014 2.1500 1.4739 2.1980 1.5260 2.6386 2.4185 2.9986 1.1976 4.1533 3.7625 4.6126 1.6523 1.9332 1.7631 1.2417 1.5143 1.9284 1.4201 1.4654 1.1765 1.0998 1.4953 1.9808 1.4823 1.3163 1.2126 1.3042 1.3646 1.3320 3.2261 1.6052 3.0250 1.4150 2.1516 1.2080 1.2380 1.5160 1.1635 1.1731 1.1583 1.0510 1.2750 1.0713 1.7553 1.0661 1.1007 1.0925 1.8315 3.8977 3.4664 4.6511 1.0696 1.0589 1.0353 1.0657 1.0672 1.0591 1.0367 1.0904 1.1029 1.1038 1.1001 1.0973 1.0641 1.0941 1.0893 1.0974 1.0912 1.1054 1.0915 1.1143 1.0738
irintensity: 0.0687 0.3179 1.2441 0.8355 11.4101 1.6485 0.9642 5.8415 3.4070 0.5550 8.8359 0.3648 2.1637 4.9771 1.3212 7.1437 2.1688 4.9983 1.2271 8.6233 5.4548 6.9948 12.4630 8.1752 3.4109 0.5346 1.5228 6.7046 8.6726 10.3034 10.9692 7.0499 6.1142 11.3302 67.5073 6.6311 36.2029 27.1662 7.3078 7.5420 16.6717 24.4347 52.9599 22.1282 29.1302 3.3333 16.2223 96.7609 32.8658 136.9714 1.6082 18.7165 12.3635 10.7718 16.8066 42.8665 20.1829 3.7104 5.2887 57.5822 6.0410 35.0720 64.4973 7.6458 8.8261 6.9371 22.6085 7.8816 79.2170 3.9352 90.7501 5.3836 4.2505 3.6259 43.1374 38.2578 0.1476 37.7704 39.4843 14.1670 41.3523 17.8874 96.6156 19.8058 14.1855 9.8360 91.4851 13.0382 38.5386 18.6989 1548.7693 63.6231 88.1046 5.0711 39.7492 37.1934 96.2029 77.3881 66.8658 21.3800 14.4233 29.1757 19.1552 45.5305 8.8815 29.7926 8.4128 12.7610 5.7344 30.3409 0.3940
temp: 298.150 k
press: 1.00000 atm
elementType: 8 8 8 7 6 6 6 6 6 6 6 6 6 6 6 6 6 6 1 1 1 1 1 1 1 1 1 1 1 1 1 1 1 1 1 1 1 1 1
symmnumber: 1
zpe: 854579.8 jmol-1
zpe.correction: 0.325492 hartree
zpe.thermalcorrener: 0.345704 hartree
zpe.thermalcorrenthalpy: 0.346648 hartree
zpe.thermalcorrgfe: 0.273684 hartree
zpe.sumelectzpe: -825.050976 hartree
zpe.sumelectthermal: -825.030764 hartree
zpe.sumelectthermalent: -825.029820 hartree
zpe.sumelectthermalfe: -825.102785 hartree
dipole: 3.7316 -2.0801 2.4937
dipole: 4.9468
quadrupole: -98.2651 -110.9291 -107.3254
quadrupole: 6.3589 6.7350 4.8120
quadrupole: 7.2414 -5.4226 -1.8188 6.3589 6.7350 4.8120
hfenergy: -825.3764684 hartree
pointgroup: C01 [X(C14H21N1O3)]
dipole: -1.6241577 0.7056399 0.8074028 debye
polarizability: 211.3102588|19.644575|199.7481166|-2.6586124|-34.3434388|123.6523123 unknown
InChI: InChI=1S/C14H21NO3/c1-4-5-11-8-12(10-15-6-7-17-2)14(16)13(9-11)18-3/h4,8-9,15-16H,1,5-7,10H2,2-3H3
charge 0 multiplicity 1
39 atoms
O  2.260749 -2.554877 0.839434
O  -0.523021 -1.786199 0.220713
O  -5.83002 -0.136533 0.107232
N  -2.122128 0.24022 0.10153
C  0.305363 0.424266 -0.425363
C  -1.106079 0.778055 -0.870221
C  2.705124 0.948251 -0.294846
C  1.374174 1.329281 -0.595928
C  0.542125 -0.891359 0.081358
C  -3.529688 0.327826 -0.373331
C  1.876838 -1.274447 0.405476
C  2.931843 -0.354175 0.204899
C  3.872279 1.910209 -0.527237
C  -4.48046 -0.328723 0.634664
C  3.633154 3.305138 0.021836
C  1.411043 -3.254497 1.824007
C  3.70658 4.451028 -0.701868
C  -6.852091 -0.758177 0.948039
H  -1.328788 0.290221 -1.841102
H  -1.211422 1.872606 -1.018348
H  1.174969 2.337917 -0.979473
H  -2.009434 0.705437 1.016483
H  -3.603178 -0.203993 -1.338609
H  -3.853019 1.376983 -0.544236
H  3.943029 -0.690858 0.45993
H  4.779029 1.484288 -0.052033
H  4.093371 1.986551 -1.611068
H  -4.245188 -1.410406 0.742566
H  -4.384818 0.148504 1.638565
H  3.383013 3.356738 1.092807
H  -1.3893 -1.180097 0.210621
H  0.396442 -3.414461 1.427535
H  1.356409 -2.674354 2.766575
H  1.925429 -4.210963 2.005773
H  3.536876 5.432986 -0.245775
H  3.94564 4.437395 -1.773113
H  -6.699534 -1.855325 1.029039
H  -6.860092 -0.321058 1.969404
H  -7.817216 -0.558195 0.457564
