program: Gaussian 09
title: 000099635
version: EM64L-G09RevD.01
frameworkgroup: C1[X(C21H18O)]
method: RPBEPBE
basis: SDD
operation: Freq
keyword: #pfreq=noraman
keyword: PBEPBE/SDD
title: #p freq=noraman PBEPBE/SDD
converged: YES YES NO NO
title: Mulliken charges:
elementType: O C C C C C C C C C C C C C C C C C C C C C H H H H H H H H H H H H H H H H H H
charge: -0.288586 0.119165 0.389750 0.023839 -0.053669 0.250049 0.156551 0.304035 0.271171 -0.656936 0.072011 -0.880049 -0.826679 -0.399825 -0.441908 -0.370908 -0.408097 -0.271629 -0.265961 -0.269322 -0.259509 -0.526040 0.271510 0.224552 0.272626 0.238738 0.237126 0.235894 0.242318 0.249450 0.226816 0.266904 0.269264 0.227130 0.227110 0.228023 0.231310 0.234110 0.226571 0.223094
chargesum: 0.00000
title: Mulliken charges with hydrogens summed into heavy atoms:
elementType: O C C C C C C C C C C C C C C C C C C C C C
charge: -0.288586 0.119165 0.389750 0.023839 -0.053669 0.250049 0.156551 0.304035 0.271171 -0.385425 0.072011 -0.144133 -0.111341 -0.150375 -0.215092 -0.104004 -0.138833 -0.044499 -0.038851 -0.041300 -0.028199 0.157735
polarizability: 4.23011301e+02 -1.67702037e+01 2.60711807e+02 -3.64661165e+00 -4.84314417e+00 1.10468634e+02
1716.lowfreq: -0.0001 0.0003 0.0007 0.8185 5.8423 7.6721 38.9432 50.3062 73.0036
frequency: 38.8708 50.2958 72.9868 99.3650 110.5790 124.1108 141.7855 160.6427 174.4406 193.7265 230.3529 253.4070 259.3293 274.1604 306.2767 318.5091 351.5847 358.3757 382.9355 392.9758 443.6730 463.6788 465.5795 484.8589 500.0480 514.8162 546.9780 568.3899 581.0152 610.3096 633.9372 646.6270 649.4697 672.7512 715.5329 730.5849 760.4556 774.8045 782.2866 800.6023 808.2926 826.4985 876.4960 888.0405 899.6312 918.2359 938.2546 956.1760 965.9315 985.2940 991.2761 1008.4928 1024.0239 1034.7039 1037.1928 1040.3351 1053.1613 1061.0741 1067.6140 1091.1069 1111.5139 1128.4335 1151.0404 1157.0822 1178.1367 1181.4490 1220.0671 1232.0744 1265.3472 1296.5064 1306.9135 1326.9469 1359.8589 1376.3186 1389.2748 1395.9564 1400.8526 1402.7667 1427.0810 1432.9492 1438.9123 1446.6218 1458.1578 1465.4848 1474.6909 1479.7583 1480.9250 1488.0972 1497.4938 1509.1085 1548.2913 1562.7047 1567.5542 1610.7664 1613.1461 1628.7908 2957.3947 2968.5539 2979.9777 3044.7384 3049.4002 3051.3763 3101.8350 3114.7078 3118.2779 3127.5293 3129.3399 3143.8926 3146.4645 3161.7758 3163.9398 3170.7470 3176.4512 3194.9924
redmass: 3.4357 3.7072 3.0711 2.2112 3.4002 2.9187 1.5164 1.0768 3.5478 4.0635 3.4035 4.4214 5.3137 1.4360 5.4608 5.3665 2.9837 3.6628 2.6257 3.5469 3.1470 4.0890 4.4000 5.2762 5.4861 3.4686 5.1546 3.9128 5.7100 3.2886 4.6982 4.3356 4.1998 5.0628 4.0114 4.7802 1.3822 1.7121 2.5145 3.6079 2.3711 4.4901 1.9806 1.4081 1.7313 4.3956 3.5160 1.3698 1.3825 1.3360 1.3533 3.1661 2.5476 1.5723 1.6231 3.6813 2.1737 2.4514 2.2614 2.4879 1.2513 2.0248 1.4961 1.6045 1.1133 1.0995 1.8689 1.6397 1.6446 2.8306 2.5238 4.0498 3.5352 4.0469 4.3840 1.7402 1.8396 1.2302 2.0612 4.0646 1.6291 2.2326 1.0609 1.6004 1.0601 1.1858 1.1085 1.6801 1.3875 1.7009 5.3869 5.4472 7.2394 6.1092 6.5746 6.9432 1.0313 1.0440 1.0425 1.1041 1.0965 1.0919 1.0967 1.1008 1.0930 1.0854 1.0858 1.0891 1.0909 1.0929 1.0980 1.0983 1.0903 1.0928
irintensity: 0.1181 1.5345 2.6680 1.2084 1.8111 0.4097 2.4448 0.0427 2.4012 0.4734 1.9788 3.0200 2.3103 0.7829 3.3089 4.1249 0.9995 0.2359 0.5060 5.3599 0.4375 4.2011 3.8475 0.8692 2.5283 4.1457 1.1716 3.1579 11.4850 0.6752 1.4495 0.7914 2.6701 2.9301 8.4870 4.5983 95.4248 34.5429 33.0337 4.3494 5.6478 4.1602 1.0378 2.0344 10.7133 20.3575 26.5293 0.4841 3.6229 0.0257 0.5052 1.6596 35.0448 2.9209 0.7560 40.9486 37.1693 21.9835 1.4692 10.0512 1.0773 19.6400 13.7869 4.3186 0.4880 0.1335 52.3178 3.9197 4.1727 21.9169 3.5760 14.0905 17.5034 12.4576 22.8694 8.5326 23.3957 8.1292 2.1041 0.8609 2.1199 7.6500 8.9672 4.6211 17.3501 14.0457 8.6701 5.6381 45.8352 27.8138 0.1777 0.7594 1.2262 4.8185 29.6363 21.9595 74.2525 31.9823 32.6677 37.9468 17.5171 20.7875 10.5157 36.9279 17.0833 1.5225 3.1011 9.5055 15.4160 35.5995 31.7023 45.4194 8.8411 11.6707
temp: 298.150 k
press: 1.00000 atm
elementType: 8 6 6 6 6 6 6 6 6 6 6 6 6 6 6 6 6 6 6 6 6 6 1 1 1 1 1 1 1 1 1 1 1 1 1 1 1 1 1 1
symmnumber: 1
zpe: 848902.5 jmol-1
zpe.correction: 0.323330 hartree
zpe.thermalcorrener: 0.341737 hartree
zpe.thermalcorrenthalpy: 0.342681 hartree
zpe.thermalcorrgfe: 0.277565 hartree
zpe.sumelectzpe: -884.749142 hartree
zpe.sumelectthermal: -884.730735 hartree
zpe.sumelectthermalent: -884.729791 hartree
zpe.sumelectthermalfe: -884.794907 hartree
dipole: -0.0763 -0.3545 1.6045
dipole: 1.6450
quadrupole: -114.1490 -113.6136 -133.5178
quadrupole: -1.4095 6.0249 2.9117
quadrupole: 6.2778 6.8132 -13.0911 -1.4095 6.0249 2.9117
hfenergy: -885.0724722 hartree
pointgroup: C01 [X(C21H18O1)]
dipole: -0.0375052 0.1540084 -0.6274632 debye
polarizability: 423.9533388|11.3801067|259.9427858|-2.2589972|-1.9344979|110.2956168 unknown
InChI: InChI=1S/C21H18O/c1-13-15-8-4-5-9-16(15)14(2)21-18-11-7-6-10-17(18)20(22-3)12-19(13)21/h4-12H,1-3H3
charge 0 multiplicity 1
40 atoms
O  3.348571 -2.352515 -0.064115
C  0.056406 0.418598 0.003481
C  -0.163744 -1.01951 0.158832
C  -1.063103 1.251545 -0.280102
C  -1.472221 -1.567906 0.265494
C  -2.392154 0.717118 -0.130695
C  1.445139 0.915369 0.138533
C  -2.603197 -0.689747 0.191707
C  2.55206 -0.008449 0.085697
C  0.983705 -1.907035 0.121795
C  2.268673 -1.432978 0.00446
C  -0.924172 2.660057 -0.84777
C  -1.634906 -3.072126 0.432949
C  -3.548492 1.565576 -0.268386
C  -3.957564 -1.148174 0.375211
C  1.763725 2.277606 0.43507
C  3.894049 0.451377 0.218503
C  -4.842731 1.08371 -0.083711
C  -5.049079 -0.292706 0.244583
C  3.090793 2.720706 0.568822
C  4.16986 1.808924 0.433924
C  3.871653 -2.560654 -1.429184
H  0.839637 -2.989288 0.154303
H  -1.085501 3.457202 -0.094796
H  0.067583 2.817051 -1.297279
H  -1.670634 2.816134 -1.64628
H  -2.681555 -3.37351 0.575788
H  -1.26458 -3.615173 -0.457965
H  -1.064708 -3.446141 1.303254
H  -3.409929 2.626672 -0.492567
H  -4.144454 -2.193987 0.632446
H  0.96094 2.991905 0.621426
H  4.699707 -0.289209 0.204388
H  -5.70096 1.758015 -0.178645
H  -6.065593 -0.67172 0.397568
H  3.287935 3.772473 0.804017
H  5.203499 2.154647 0.542494
H  4.71445 -3.260818 -1.32274
H  4.22368 -1.61052 -1.876776
H  3.092315 -3.003419 -2.079437
