program: Gaussian 09
title: 000099553
version: EM64L-G09RevD.01
frameworkgroup: C1[X(C7H9Cl4NO2)]
method: RPBEPBE
basis: SDD
operation: Freq
keyword: #p
keyword: freq=noraman
keyword: PBEPBE/SDD
title: #p freq=noraman PBEPBE/SDD
converged: NO YES NO NO
title: Mulliken charges:
elementType: Cl Cl Cl Cl O O N C C C C C C C H H H H H H H H H
charge: 0.069443 0.023008 0.067187 0.025633 -0.448296 -0.255427 -0.586322 0.330287 -0.516484 -0.514960 -0.348196 -0.348053 -0.363540 0.217227 0.281159 0.262633 0.262748 0.280818 0.239681 0.226181 0.371767 0.340709 0.382797
chargesum: 0.00000
title: Mulliken charges with hydrogens summed into heavy atoms:
elementType: Cl Cl Cl Cl O O N C C C C C C C
charge: 0.069443 0.023008 0.067187 0.025633 -0.076529 -0.255427 0.137185 0.330287 -0.516484 -0.514960 0.195595 0.195513 0.102323 0.217227
polarizability: 1.20975830e+02 -1.83324462e-01 1.37558446e+02 1.02349652e-01 1.67179399e+00 1.12890320e+02
1716.lowfreq: -0.0015 0.0022 0.0024 5.2409 8.2209 11.3796 92.0473 95.7454 97.6166
frequency: 92.0393 95.7176 97.5858 142.8780 155.2789 194.0679 196.8545 223.7803 228.2566 237.8268 245.2792 271.2373 290.1568 321.8846 323.9968 342.2215 357.8224 385.1055 438.4036 482.5556 484.3884 510.7713 550.9733 595.6819 616.4515 651.4514 688.3912 689.9295 722.0152 769.4717 880.9555 889.6791 921.6653 948.6207 973.3200 1030.6566 1062.1966 1078.8492 1104.1026 1121.7669 1157.7596 1188.9778 1224.4190 1275.1670 1290.0456 1341.9913 1344.7750 1345.7165 1347.6826 1436.9301 1448.5830 1465.9559 1561.0292 1658.0492 3013.7633 3014.7041 3015.5399 3074.6632 3086.6563 3091.5730 3500.0752 3505.4955 3664.8375
redmass: 10.5763 6.1014 10.1401 22.9683 8.5505 13.1006 14.8520 4.2306 3.9887 9.3824 2.1348 8.9927 2.6062 11.2978 2.7917 7.3915 2.6515 3.8767 3.9956 3.1830 5.2069 2.4201 3.7574 3.6468 1.7181 3.8219 1.3329 4.1284 4.2393 3.1687 2.6093 1.6740 3.5639 3.2098 5.5624 2.1684 4.2183 2.1181 2.6461 4.1966 4.8656 1.1906 1.4189 1.3542 1.3376 1.3448 1.4088 1.3197 2.8319 1.0840 1.0890 1.0808 1.2584 6.4715 1.0591 1.0629 1.0633 1.1008 1.1010 1.1025 1.0496 1.0607 1.1043
irintensity: 2.6820 12.3935 3.4495 0.0213 3.3424 0.0657 2.4891 0.5692 21.9771 6.4136 36.3081 2.5070 79.7665 4.5932 34.6561 22.0953 4.5525 35.9748 1.6695 13.1842 4.7704 0.5639 52.9324 3.2829 173.6601 14.1284 151.3876 54.1521 37.9079 25.8460 7.3995 9.9712 53.9705 28.8326 12.7717 7.3416 56.6174 8.9096 68.5113 5.1030 7.2326 0.4882 15.3145 56.4846 52.0168 3.3009 18.6663 0.6714 112.9951 22.3496 43.8181 15.6928 113.0779 271.2915 16.6336 11.7365 9.2638 13.6671 6.0127 1.8790 74.3514 24.3281 71.0723
temp: 298.150 k
press: 1.00000 atm
elementType: 17 17 17 17 8 8 7 6 6 6 6 6 6 6 1 1 1 1 1 1 1 1 1
symmnumber: 1
zpe: 415515.0 jmol-1
zpe.correction: 0.158261 hartree
zpe.thermalcorrener: 0.173062 hartree
zpe.thermalcorrenthalpy: 0.174006 hartree
zpe.thermalcorrgfe: 0.117345 hartree
zpe.sumelectzpe: -2316.518543 hartree
zpe.sumelectthermal: -2316.503742 hartree
zpe.sumelectthermalent: -2316.502798 hartree
zpe.sumelectthermalfe: -2316.559459 hartree
dipole: -0.0006 -0.0743 0.1928
dipole: 0.2066
quadrupole: -118.3173 -103.3839 -104.3644
quadrupole: -0.1686 0.0219 -9.9542
quadrupole: -9.6288 5.3046 4.3242 -0.1686 0.0219 -9.9542
hfenergy: -2316.6768041 hartree
pointgroup: C01 [X(C7H9Cl4N1O2)]
dipole: 0.0268365 0.0426562 -0.0637827 debye
dipolederiv: -0.2771512 0.1856422 -0.003124 0.1958313 -0.7055417 -0.0138186 -0.0213181 0.0047474 -0.1521245 -0.3744604 -0.1439778 -0.1985758 -0.0923476 -0.2802948 -0.1589153 -0.1826483 -0.1967383 -0.4727628 -0.7776527 0.0047286 0.01613 -0.0061172 -0.204961 -0.0089934 0.0393272 -0.0205274 -0.1556246 -0.2218122 -0.0395407 -0.0902766 -0.0902449 -0.4225014 -0.2378307 -0.1327244 -0.2388899 -0.4742584 -0.5150635 0.1137305 0.0772556 0.1138173 -0.442036 0.1182671 0.1059189 0.1644224 -0.7082711 -0.4453691 -0.1281244 -0.0376298 -0.1331905 -0.5446273 -0.0292639 0.1010114 0.1698387 -0.9763161 -0.7083007 -0.2091402 0.2272302 -0.2066813 -0.8814556 0.3228494 0.1279153 0.1823245 -0.5059221 0.011524 -0.1949225 -0.1771549 -0.1966391 -0.1094684 -0.2655884 -0.2015736 -0.303972 0.2071309 0.6450104 -0.0307271 0.2671939 -0.0148718 1.006489 0.215801 0.2498721 0.1564907 0.6364664 0.9808778 0.1205747 0.0943795 0.1090367 0.6546415 0.3229559 0.0439219 0.2850686 0.6460134 -0.0998118 0.0338134 0.0182349 -0.0070883 -0.138649 -0.0211237 -0.0484357 -0.0067385 -0.1631303 -0.1435163 -0.0242175 -0.0271784 0.0183696 -0.0952426 0.0105631 0.0105385 -0.0435962 -0.1617267 0.1473191 -0.0344264 -0.0074053 -0.0379706 0.1171017 -0.005212 0.0710884 0.1080964 0.0518312 0.5855155 0.5214421 -0.1047346 0.5168716 0.9743255 -0.1902147 -0.0592089 -0.1265171 1.261836 0.1662875 -0.007677 -0.0476799 0.0241771 0.0402866 0.0042914 -0.0554542 -0.0301247 0.0373445 -0.0976848 0.0216617 0.0426472 0.0177392 0.0632961 0.0308687 0.0116969 0.0140768 0.0993458 0.0313762 0.0662358 0.0183248 0.0718571 -0.066275 0.0425643 0.014116 0.0083891 0.0994068 0.0512825 -0.0237306 0.0190344 -0.0531122 0.1575638 -0.0376552 -0.0106662 -0.0580809 0.0332745 0.0218259 -0.0219927 -0.033651 -0.0196074 0.0117987 -0.0479985 -0.082411 -0.1186209 0.0265372 0.0186051 0.0016875 0.0543473 0.0008659 0.0127993 0.0839206 0.0685807 0.1043898 -0.0872991 0.3586898 -0.1397017 -0.0916886 -0.141476 0.2572393 -0.1218881 -0.0426761 -0.0538339 0.3281136 0.3151658 -0.0547473 -0.0244014 -0.0545614 0.2784921 -0.0273049 0.0048948 0.0146727 0.1666911 0.3273431 -0.0165905 0.0087226 -0.0146577 0.3170192 0.0137259 -0.0117655 -0.0148774 0.2634443 unknown
polarizability: 125.6937917|6.4502241|129.7362597|4.565566|6.9756551|115.994545 unknown
InChI: InChI=1S/C7H9Cl4NO2/c8-5(9)2-1-3-6(10,11)7(5,14)4(12)13/h14H,1-3,12H2
charge 0 multiplicity 1
23 atoms
Cl 1.889567 -2.246726 0.0225
Cl 2.351182 0.34859 1.466704
Cl -2.698514 0.921142 0.178608
Cl -0.371342 2.226464 1.558647
O  -0.45151 -0.821096 1.76753
O  -0.912384 -1.317104 -1.790099
N  -1.613348 -2.394133 0.155466
C  -0.202573 -0.38926 0.416106
C  1.335229 -0.439786 0.054918
C  -0.810208 1.04349 0.130945
C  1.711103 0.227844 -1.264374
C  -0.382583 1.670677 -1.192432
C  1.154457 1.667264 -1.353346
C  -0.951043 -1.421832 -0.529465
H  1.27064 -0.387594 -2.071034
H  2.80868 0.210884 -1.37257
H  -0.792735 2.692865 -1.252045
H  -0.837579 1.063195 -1.99686
H  1.625875 2.314026 -0.591217
H  1.40709 2.082696 -2.344981
H  0.011314 -0.207574 2.398573
H  -2.127145 -3.102463 -0.366375
H  -1.583872 -2.39067 1.1767
