program: Gaussian 09
title: 000099541
version: EM64L-G09RevD.01
frameworkgroup: C1[X(C6H2Br3NO)]
method: RPBEPBE
basis: SDD
operation: Freq
keyword: #p
keyword: freq=noraman
keyword: PBEPBE/SDD
title: #p freq=noraman PBEPBE/SDD
converged: NO YES NO NO
title: Mulliken charges:
elementType: Br Br Br O N C C C C C C H H
charge: 0.114435 0.121473 0.116124 -0.137063 -0.294542 0.163288 -0.228338 -0.152658 -0.330285 -0.317724 0.373451 0.292391 0.279449
chargesum: 0.00000
title: Mulliken charges with hydrogens summed into heavy atoms:
elementType: Br Br Br O N C C C C C C
charge: 0.114435 0.121473 0.116124 -0.137063 -0.294542 0.163288 0.064052 0.126791 -0.330285 -0.317724 0.373451
polarizability: 2.41861065e+02 2.02100689e+01 1.53170036e+02 -1.82412141e-03 -3.84026290e-03 3.77551680e+01
1716.lowfreq: -4.3680 -1.1380 -0.0005 -0.0004 0.0003 3.6363 54.9759 65.8978 84.1410
frequency: 54.9681 65.8896 84.1403 118.0989 151.6121 181.4352 243.2959 253.9847 265.2519 323.1255 337.5927 446.1925 498.7229 537.3583 606.3585 653.9517 700.6217 770.1857 797.0603 871.7056 882.2054 901.7499 980.4156 1117.3874 1256.8235 1289.2776 1309.8701 1441.7838 1559.4149 1562.8828 1598.0112 3167.8593 3180.8810
redmass: 13.0937 13.0091 43.8817 39.4433 6.5296 42.9674 7.3470 15.9810 17.2973 5.7815 8.7055 4.9176 12.1600 9.4373 4.1812 8.7360 10.4882 7.1198 9.5126 1.3815 7.1711 1.4622 3.8208 2.9637 2.0243 1.7016 3.5265 7.5376 10.2962 11.8316 8.2907 1.0926 1.0936
irintensity: 2.9700 0.0447 0.6786 0.7094 3.6801 0.3088 0.6891 1.1729 0.3941 5.8071 18.3797 0.1000 21.3781 39.0788 0.1819 86.6168 74.3126 4.6419 18.2213 0.6096 19.3119 37.3218 70.1503 1.3343 85.7561 0.6237 29.4306 19.0838 129.9557 168.7111 10.7708 2.5780 3.5487
temp: 298.150 k
press: 1.00000 atm
elementType: 35 35 35 8 7 6 6 6 6 6 6 1 1
symmnumber: 1
zpe: 168734.0 jmol-1
zpe.correction: 0.064267 hartree
zpe.thermalcorrener: 0.075179 hartree
zpe.thermalcorrenthalpy: 0.076123 hartree
zpe.thermalcorrgfe: 0.023573 hartree
zpe.sumelectzpe: -399.343839 hartree
zpe.sumelectthermal: -399.332928 hartree
zpe.sumelectthermalent: -399.331984 hartree
zpe.sumelectthermalfe: -399.384534 hartree
dipole: -2.0882 -0.3032 0.0011
dipole: 2.1101
quadrupole: -96.4482 -90.8913 -90.8856
quadrupole: -10.6478 0.0038 0.0019
quadrupole: -3.7065 1.8504 1.8561 -10.6478 0.0038 0.0019
hfenergy: -399.4081067 hartree
pointgroup: C01 [X(C6H2Br3N1O1)]
dipole: 0.8289633 -0.0445347 0.0004245 debye
dipolederiv: -0.4490178 0.3493112 -0.0000224 0.4381085 -0.3126677 0.0000757 -0.000162 0.0001248 0.0426814 -0.0104318 -0.0711622 0.0000234 -0.240398 -0.7507164 -0.0000738 -0.0000621 -0.000182 0.0439555 -0.8596687 0.1390465 0.0000379 0.7898225 -0.092552 -0.0000359 0.0002265 0.0000067 0.0447865 -0.9380628 -0.1684378 0.0005502 -0.2388105 -0.4026251 0.000208 -0.0004169 -0.0001635 -0.2806938 1.0009572 -0.0858154 -0.0001634 -0.7516803 -0.2415977 -0.0000099 -0.0004206 -0.0000227 -0.2619716 -0.1695694 -0.1687673 0.0001686 0.0255401 0.6457629 0.0000682 0.000101 0.0000538 0.1165215 -0.184181 0.3693735 -0.0001708 0.0070191 -0.0502347 -0.0001056 0.0002915 0.000088 -0.0118216 -0.0168802 -0.3449925 -0.0002262 -0.0275641 -0.626475 -0.0000342 0.000212 0.0000081 0.0002241 0.7151366 -0.7288737 0.0001757 -1.0000945 0.1162714 -0.0000268 0.0000573 -0.0000061 -0.1670006 -0.2503622 0.4498262 0.0001077 0.664246 1.2295501 0.0001321 0.0000615 0.0000578 -0.1381876 0.9836351 0.2128906 -0.0004848 0.3175046 0.4077431 -0.0002017 0.000062 0.0000754 0.2965224 0.1220247 -0.0327264 -0.0000241 0.0257072 0.0285248 0.0000581 0.0000452 0.0000229 0.1570874 0.0564203 0.0803273 0.0000282 -0.0094008 0.0490164 -0.0000543 0.0000045 -0.0000632 0.1578966 unknown
polarizability: 246.2244305|1.5545373|148.8066708|0.0025434|0.0034068|37.755168 unknown
InChI: InChI=1S/C6H2Br3NO/c7-4-1-3(10-9)2-5(8)6(4)11/h1-2H
charge 0 multiplicity 1
13 atoms
Br -2.686772 2.251654 -0.000452
Br -0.653168 -3.225519 -0.00043
Br 4.072845 0.128534 -0.000191
O  -2.679898 -0.86964 -0.000428
N  2.422491 1.24147 0.000086
C  1.250895 0.585396 0.000216
C  0.106354 1.515304 -0.000019
C  0.992805 -0.855242 -0.000022
C  -1.176665 1.037916 0.000156
C  -0.293778 -1.32342 0.000147
C  -1.50037 -0.4240 0.001131
H  0.333821 2.584499 -0.000448
H  1.84974 -1.534453 -0.000445
