program: Gaussian 09
title: 000099537
version: EM64L-G09RevD.01
frameworkgroup: C1[X(C8H10O2)]
method: RPBEPBE
basis: SDD
operation: Freq
keyword: #pfreq=noraman
keyword: PBEPBE/SDD
title: #p freq=noraman PBEPBE/SDD
converged: NO YES NO NO
title: Mulliken charges:
elementType: O O C C C C C C C C H H H H H H H H H H
charge: -0.283338 -0.196721 -0.530435 0.382040 -0.438906 -0.423852 0.330837 -0.382354 -0.785802 -0.055708 0.244282 0.239576 0.243374 0.256618 0.255968 0.253596 0.235868 0.237687 0.241236 0.176035
chargesum: 0.00000
title: Mulliken charges with hydrogens summed into heavy atoms:
elementType: O O C C C C C C C C
charge: -0.283338 -0.196721 -0.046577 0.382040 0.061086 -0.167884 0.330837 -0.128759 -0.071011 0.120328
polarizability: 1.18220121e+02 -2.97034462e+00 8.73737762e+01 5.33162770e+00 -3.93205198e-01 6.01418705e+01
1716.lowfreq: -4.2378 -0.0004 0.0002 0.0004 2.6655 12.9228 39.9749 54.2462 87.5160
frequency: 39.9272 54.0888 87.5097 124.7023 172.8406 182.6476 209.1267 259.9953 335.9568 397.8306 572.8221 610.1166 632.8471 651.1398 667.0935 769.6144 800.8644 831.1637 855.9258 890.7649 907.4237 930.1352 989.9338 1020.8967 1036.5070 1047.5816 1070.3480 1145.1492 1195.7510 1209.0126 1224.0255 1262.0478 1274.1934 1336.7617 1353.9348 1374.0666 1403.6445 1425.7595 1454.2333 1455.9046 1472.7387 1578.9705 1612.8671 1642.3418 2856.9177 2968.5322 2979.1267 2998.7955 3013.2887 3054.2066 3072.7922 3099.9339 3214.5436 3233.3504
redmass: 5.5094 2.7250 3.7590 1.1162 1.7416 6.7095 3.2262 2.7362 3.5264 3.0503 5.1989 3.6394 4.0566 4.1922 1.2553 4.0131 1.2207 1.4372 1.4317 3.0294 3.0703 5.5112 1.8904 1.4045 1.5873 1.4568 2.7575 1.4658 3.1934 1.4817 3.7260 1.4077 1.3352 2.3558 1.7525 1.2312 1.2453 1.0872 1.0873 1.0439 1.0892 7.8697 6.4249 7.5273 1.0846 1.0627 1.0377 1.0663 1.0941 1.0983 1.0969 1.0974 1.0940 1.1039
irintensity: 4.8254 3.9982 1.8775 0.2850 2.8734 12.8968 6.6548 1.6283 4.3476 1.2706 8.2116 0.3406 2.2990 3.5660 8.0717 3.4953 68.3734 3.8114 0.3649 5.1892 15.2703 5.6853 3.9275 19.8409 17.0231 6.1263 0.6667 14.0635 24.3137 0.4799 7.3325 7.9839 14.0891 14.1062 13.4242 6.4046 7.4378 38.1675 17.0244 15.8286 14.2260 24.6589 18.1947 132.9521 158.0337 27.8912 34.3696 12.4607 6.5556 18.8462 13.4090 14.3737 8.1241 0.8120
temp: 298.150 k
press: 1.00000 atm
elementType: 8 8 6 6 6 6 6 6 6 6 1 1 1 1 1 1 1 1 1 1
symmnumber: 1
zpe: 419068.0 jmol-1
zpe.correction: 0.159615 hartree
zpe.thermalcorrener: 0.169992 hartree
zpe.thermalcorrenthalpy: 0.170936 hartree
zpe.thermalcorrgfe: 0.122440 hartree
zpe.sumelectzpe: -460.514158 hartree
zpe.sumelectthermal: -460.503781 hartree
zpe.sumelectthermalent: -460.502837 hartree
zpe.sumelectthermalfe: -460.551333 hartree
dipole: 2.4433 -0.9102 1.9768
dipole: 3.2720
quadrupole: -64.7951 -54.6658 -60.4232
quadrupole: 2.2650 -6.3816 0.0828
quadrupole: -4.8337 5.2955 -0.4618 2.2650 -6.3816 0.0828
hfenergy: -460.6737729 hartree
pointgroup: C01 [X(C8H10O2)]
dipole: 0.9604911 0.1333111 -0.8466489 debye
dipolederiv: -0.6306168 0.0335762 0.0543353 0.0423881 -0.6224611 0.0461285 0.0465773 0.040677 -0.1351488 -0.7639148 0.0108455 0.1467301 -0.0547581 -0.3406292 0.1214816 0.2783151 0.0962845 -0.6014954 0.0381722 -0.0201704 0.0011965 0.080277 0.0887623 0.0314531 0.0081874 0.0402851 0.1053699 0.3859768 -0.0753385 -0.0251284 -0.0218532 0.3513388 -0.0247738 -0.1209689 -0.014004 -0.0611451 -0.5742058 0.0584111 0.1182034 0.0015994 0.1077806 0.0646635 0.2818032 0.0503582 -0.0012391 -0.121743 0.0619883 -0.0277125 0.1002842 -0.0669669 -0.0255829 -0.0252138 -0.0271605 -0.2126078 0.3832075 0.0382847 -0.0646843 0.012408 0.4151341 -0.0384714 -0.0500669 -0.041854 -0.0196274 -0.0499136 -0.0117292 -0.0379792 -0.0735195 -0.1804939 -0.0035168 -0.0057066 -0.0080386 -0.2299699 -0.0090577 -0.0116047 0.014527 -0.1081348 -0.0272483 0.0262374 0.0225622 0.0117174 0.0972328 1.1624793 -0.1116077 -0.1826767 -0.0941054 0.2251519 -0.2830118 -0.2215685 -0.2810713 0.7169697 0.0451381 -0.0363898 0.0053582 -0.057959 -0.0778733 0.0396404 -0.0209755 0.0245706 0.0846739 -0.0000982 0.020295 0.0353594 0.0592478 0.0366988 -0.0881067 0.0212896 -0.0647363 -0.0435244 0.090728 0.0130533 0.0014597 0.0392546 0.0572459 -0.0981073 -0.0650371 -0.0574897 -0.0612116 0.1011745 -0.0448919 0.0162388 -0.0189728 -0.0511164 0.0526156 -0.0397467 0.0368422 0.104378 0.096707 -0.0693242 0.0209097 -0.0659272 -0.0236478 0.0291634 0.0188803 0.0327421 0.188279 -0.0439463 0.0672255 0.020756 0.0650003 0.0980647 0.0028009 0.0246289 0.0008835 0.1967521 -0.0985853 0.0293412 0.0242119 0.1051323 0.0512185 -0.0063458 0.017206 0.00351 0.1209007 0.0591484 -0.0036977 -0.0607442 -0.0480199 -0.0007442 0.095912 0.0023283 0.1345764 -0.0583072 0.0669759 -0.0298974 0.0342706 -0.0756479 -0.0444724 -0.0871055 -0.01658 -0.1317579 -0.0214833 -0.1376261 0.0816307 -0.0946314 0.1133062 0.0042579 0.1449256 -0.1559143 0.1536652 -0.1687958 unknown
polarizability: 118.1996836|1.627326|85.0423978|-5.8704043|-7.7126808|62.4936866 unknown
InChI: InChI=1S/C8H10O2/c1-7-4-5-8(10-7)3-2-6-9/h4-6H,2-3H2,1H3
charge 0 multiplicity 1
20 atoms
O  0.978159 0.649493 0.063331
O  -4.064038 0.101467 0.472397
C  -1.224484 -0.416979 0.469549
C  0.253862 -0.553101 0.277214
C  -1.921764 0.278044 -0.723248
C  1.141437 -1.615717 0.273166
C  2.345126 0.29989 -0.072805
C  2.470451 -1.073665 0.053499
C  3.30257 1.423415 -0.30518
C  -3.414279 0.46989 -0.535972
H  -1.657748 -1.420644 0.621473
H  -1.449585 0.155748 1.390054
H  -1.767549 -0.291715 -1.664452
H  -1.468213 1.273117 -0.913305
H  0.881183 -2.663083 0.4154
H  3.400898 -1.635346 -0.00452
H  4.327199 1.026438 -0.395094
H  3.065103 1.977662 -1.232544
H  3.286522 2.150144 0.528457
H  -3.93085 0.983044 -1.389618
